Build #92

Build: #92 failed Scheduled with changes by mattwuenschel <mwuenschel@google.com>

Stages & jobs

  1. Variables

  2. Spinup and Test

Build result summary

Details

Completed
Duration
291 minutes
Labels
None
Revisions
caskdata/cdap-integration-tests
fd4631809e3d5d45bf3cf7f151a0e22e14abdc73 fd4631809e3d5d45bf3cf7f151a0e22e14abdc73
caskdata/coopr-internal
27d1ed069cb3acb10963f751b2bb0bd4f30a459c 27d1ed069cb3acb10963f751b2bb0bd4f30a459c
Total tests
55

Responsible

No one has taken responsibility for this failure

Code commits

caskdata/coopr-internal
Author Commit Message Commit date
mattwuenschel <mwuenschel@google.com> mattwuenschel <mwuenschel@google.com> 27d1ed069cb3acb10963f751b2bb0bd4f30a459c 27d1ed069cb3acb10963f751b2bb0bd4f30a459c Merge pull request #723 from caskdata/feature/coopr_base_kdc
configurable kdc server and realm
mattwuenschel <mwuenschel@google.com> mattwuenschel <mwuenschel@google.com> 6b9e8a704784b8dc9b4ea42117e6b7ee77584b0c m 6b9e8a704784b8dc9b4ea42117e6b7ee77584b0c resucue protential nilpointer
mattwuenschel <mwuenschel@google.com> mattwuenschel <mwuenschel@google.com> 83561e4b447e893619d9c28ce28f4b0baf706086 m 83561e4b447e893619d9c28ce28f4b0baf706086 configurable kdc server and realm

Tests

New test failures 4
Status Test View job Duration
Collapse Failed WranglerServiceTest test History
Ambari - HDP 2.6 1 min
java.io.IOException: 500: Exception encountered while processing request : null
	at co.cask.cdap.client.util.RESTClient.execute(RESTClient.java:132)
	at co.cask.cdap.client.util.RESTClient.execute(RESTClient.java:91)
	at co.cask.cdap.app.etl.wrangler.WranglerServiceTest.schema(WranglerServiceTest.java:146)
	at co.cask.cdap.app.etl.wrangler.WranglerServiceTest.test(WranglerServiceTest.java:120)
Collapse Failed WranglerTest testWranglerMR History
Ambari - HDP 2.6 11 mins
java.util.concurrent.TimeoutException: Timeout occurred. Expected true but found false.
	at co.cask.cdap.common.utils.Tasks.waitFor(Tasks.java:70)
	at co.cask.cdap.common.utils.Tasks.waitFor(Tasks.java:91)
	at co.cask.cdap.common.utils.Tasks.waitFor(Tasks.java:130)
	at co.cask.cdap.test.AbstractProgramManager.waitForRuns(AbstractProgramManager.java:96)
	at co.cask.cdap.test.AbstractProgramManager.waitForRun(AbstractProgramManager.java:90)
	at co.cask.cdap.app.etl.wrangler.WranglerTest.testWrangler(WranglerTest.java:182)
	at co.cask.cdap.app.etl.wrangler.WranglerTest.testWranglerMR(WranglerTest.java:81)
Collapse Failed WranglerTest testWranglerSpark History
Ambari - HDP 2.6 11 mins
java.util.concurrent.TimeoutException: Timeout occurred. Expected true but found false.
	at co.cask.cdap.common.utils.Tasks.waitFor(Tasks.java:70)
	at co.cask.cdap.common.utils.Tasks.waitFor(Tasks.java:91)
	at co.cask.cdap.common.utils.Tasks.waitFor(Tasks.java:130)
	at co.cask.cdap.test.AbstractProgramManager.waitForRuns(AbstractProgramManager.java:96)
	at co.cask.cdap.test.AbstractProgramManager.waitForRun(AbstractProgramManager.java:90)
	at co.cask.cdap.app.etl.wrangler.WranglerTest.testWrangler(WranglerTest.java:182)
	at co.cask.cdap.app.etl.wrangler.WranglerTest.testWranglerSpark(WranglerTest.java:89)
Collapse Failed ApplicationTest test History
Ambari - HDP 2.6 59 secs
java.lang.RuntimeException: java.io.IOException: 500: No server address listed in hbase:meta for region cdap_system:config.store.table,,1540609890788.372dcddfe7200312c8884fd88ced57af. containing row \x00\x00\x00\x00\x00\x00\x00\x00\x0Bpreferences\x00\x00\x00\x0C\x00\x00\x00\x08instance
	at co.cask.cdap.client.util.RESTClient.execute(RESTClient.java:132)
	at co.cask.cdap.client.util.RESTClient.execute(RESTClient.java:69)
	at co.cask.cdap.client.ProgramClient.start(ProgramClient.java:132)
	at co.cask.cdap.test.remote.RemoteApplicationManager.startProgram(RemoteApplicationManager.java:140)
	at co.cask.cdap.test.AbstractProgramManager.start(AbstractProgramManager.java:56)
	at co.cask.cdap.test.AbstractProgramManager.start(AbstractProgramManager.java:51)
	at co.cask.cdap.apps.ApplicationTest.test(ApplicationTest.java:40)