Build #62

Build: #62 failed Scheduled

Stages & jobs

  1. Variables

  2. Spinup and Test

Build result summary

Details

Completed
Duration
280 minutes
Labels
None
Revisions
caskdata/cdap-integration-tests
b161105f660abd4ebaf22f7aa276bc053cb5990a b161105f660abd4ebaf22f7aa276bc053cb5990a
caskdata/coopr-internal
36b1c5c59bf8e8aae9b59c613750368fe8a07c27 36b1c5c59bf8e8aae9b59c613750368fe8a07c27
Total tests
55
Fixed in
#63 (Scheduled)

Responsible

No one has taken responsibility for this failure

Tests

New test failures 1
Status Test View job Duration
Collapse Failed BatchAggregatorTest test History
Ambari - HDP 2.6 4 mins
java.util.concurrent.ExecutionException: java.lang.RuntimeException: java.io.IOException: 500: org.apache.hadoop.hbase.exceptions.RegionMovedException: Region moved to: hostname=it-ambs2-ambh26-62-34981-1003.coopr.sh port=16020 startCode=1536979942052. As of locationSeqNum=278.
 at org.apache.hadoop.hbase.regionserver.HRegionServer.getRegionByEncodedName(HRegionServer.java:3115)
 at org.apache.hadoop.hbase.regionserver.RSRpcServices.getRegion(RSRpcServices.java:1034)
 at org.apache.hadoop.hbase.regionserver.RSRpcServices.scan(RSRpcServices.java:2400)
 at org.apache.hadoop.hbase.protobuf.generated.ClientProtos$ClientService$2.callBlockingMethod(ClientProtos.java:32385)
 at org.apache.hadoop.hbase.ipc.RpcServer.call(RpcServer.java:2150)
 at org.apache.hadoop.hbase.ipc.CallRunner.run(CallRunner.java:112)
 at org.apache.hadoop.hbase.ipc.RpcExecutor$Handler.run(RpcExecutor.java:187)
(24 more lines...)