Build #24

Build: #24 failed Scheduled

Stages & jobs

  1. Variables

  2. Spinup and Test

Build result summary

Details

Completed
Duration
321 minutes
Labels
None
Revisions
caskdata/cdap-integration-tests
33ca06a919bc191bb2b52d458ad4b6d7ef17737b 33ca06a919bc191bb2b52d458ad4b6d7ef17737b
caskdata/coopr-internal
106a354d8d9aff7d15e1cf80f1353351fe9742db 106a354d8d9aff7d15e1cf80f1353351fe9742db
Total tests
116
Failing since
#1 (Manual run by Matt Wuenschel)
Fixed in
#46 (Scheduled with changes by 3 people)

Responsible

Tests

New test failures 2
Status Test View job Duration
Collapse Failed SparkPageRankAppTest test History
Ambari - HDP 2.5 11 mins
java.util.concurrent.TimeoutException: Timeout occurred. Expected true but found false.
	at co.cask.cdap.common.utils.Tasks.waitFor(Tasks.java:70)
	at co.cask.cdap.common.utils.Tasks.waitFor(Tasks.java:91)
	at co.cask.cdap.common.utils.Tasks.waitFor(Tasks.java:130)
	at co.cask.cdap.test.AbstractProgramManager.waitForRuns(AbstractProgramManager.java:81)
	at co.cask.cdap.test.AbstractProgramManager.waitForRun(AbstractProgramManager.java:75)
	at co.cask.cdap.apps.spark.sparkpagerank.SparkPageRankAppTest.test(SparkPageRankAppTest.java:141)
Collapse Failed WorkflowTest testKMeans History
Ambari - HDP 2.5 7 mins
java.util.concurrent.TimeoutException: Timeout occurred. Expected true but found false.
	at co.cask.cdap.common.utils.Tasks.waitFor(Tasks.java:70)
	at co.cask.cdap.common.utils.Tasks.waitFor(Tasks.java:91)
	at co.cask.cdap.apps.workflow.WorkflowTest.testWorkflow(WorkflowTest.java:133)
	at co.cask.cdap.apps.workflow.WorkflowTest.testKMeans(WorkflowTest.java:108)
Existing test failures 2
Status Test Failing since View job Duration
java.util.concurrent.TimeoutException: Timeout occurred. Expected true but found false.
	at co.cask.cdap.common.utils.Tasks.waitFor(Tasks.java:70)
	at co.cask.cdap.common.utils.Tasks.waitFor(Tasks.java:91)
	at co.cask.cdap.common.utils.Tasks.waitFor(Tasks.java:130)
	at co.cask.cdap.test.AbstractProgramManager.waitForRuns(AbstractProgramManager.java:81)
	at co.cask.cdap.test.AbstractProgramManager.waitForRun(AbstractProgramManager.java:75)
	at co.cask.cdap.apps.spark.sparkpagerank.SparkPageRankAppTest.test(SparkPageRankAppTest.java:141)
java.util.concurrent.TimeoutException: Timeout occurred. Expected true but found false.
	at co.cask.cdap.common.utils.Tasks.waitFor(Tasks.java:70)
	at co.cask.cdap.common.utils.Tasks.waitFor(Tasks.java:91)
	at co.cask.cdap.apps.workflow.WorkflowTest.testWorkflow(WorkflowTest.java:133)
	at co.cask.cdap.apps.workflow.WorkflowTest.testKMeans(WorkflowTest.java:108)