Build #202

Build: #202 failed Scheduled with changes by albertshau <ashau@google.com>

Stages & jobs

  1. Variables

  2. Spinup and Test

Build result summary

Details

Completed
Duration
251 minutes
Labels
None
Revisions
caskdata/cdap-integration-tests
4bff53fd3ee7cd7739ae65464ee0227fac73c173 4bff53fd3ee7cd7739ae65464ee0227fac73c173
caskdata/coopr-internal
c1288c34d0c03e0d41d6703a7d9daa14292ef32c c1288c34d0c03e0d41d6703a7d9daa14292ef32c
Total tests
46
Failing since
#92 (Scheduled with changes by mattwuenschel <mwuenschel@google.com>)

Responsible

This build has been failing since #92
No one has taken responsibility

Code commits

caskdata/cdap-integration-tests
Author Commit Message Commit date
albertshau <ashau@google.com> albertshau <ashau@google.com> 4bff53fd3ee7cd7739ae65464ee0227fac73c173 4bff53fd3ee7cd7739ae65464ee0227fac73c173 Merge pull request #1000 from cdapio/feature/CDAP-14908-remove-app-version-test
CDAP-14908 remove app version test since CDAP no longer supports it
albertshau <ashau@google.com> albertshau <ashau@google.com> 4ad69efa57dc9cb51fe8ee4d1018c155b4c9ade9 4ad69efa57dc9cb51fe8ee4d1018c155b4c9ade9 CDAP-14908 remove app version test since CDAP no longer supports it

Tests

Existing test failures 3
Status Test Failing since View job Duration
java.io.IOException: 500: {"values":[]}
	at co.cask.cdap.client.util.RESTClient.execute(RESTClient.java:132)
	at co.cask.cdap.client.util.RESTClient.execute(RESTClient.java:74)
	at co.cask.cdap.app.etl.wrangler.WranglerServiceTest.createAndUploadWorkspace(WranglerServiceTest.java:150)
	at co.cask.cdap.app.etl.wrangler.WranglerServiceTest.test(WranglerServiceTest.java:114)
java.util.concurrent.TimeoutException: Timeout occurred. Expected true but found false.
	at co.cask.cdap.common.utils.Tasks.waitFor(Tasks.java:70)
	at co.cask.cdap.common.utils.Tasks.waitFor(Tasks.java:91)
	at co.cask.cdap.common.utils.Tasks.waitFor(Tasks.java:130)
	at co.cask.cdap.test.AbstractProgramManager.waitForRuns(AbstractProgramManager.java:96)
	at co.cask.cdap.test.AbstractProgramManager.waitForRun(AbstractProgramManager.java:90)
	at co.cask.cdap.app.etl.wrangler.WranglerTest.testWrangler(WranglerTest.java:177)
	at co.cask.cdap.app.etl.wrangler.WranglerTest.testWranglerMR(WranglerTest.java:84)
java.util.concurrent.TimeoutException: Timeout occurred. Expected true but found false.
	at co.cask.cdap.common.utils.Tasks.waitFor(Tasks.java:70)
	at co.cask.cdap.common.utils.Tasks.waitFor(Tasks.java:91)
	at co.cask.cdap.common.utils.Tasks.waitFor(Tasks.java:130)
	at co.cask.cdap.test.AbstractProgramManager.waitForRuns(AbstractProgramManager.java:96)
	at co.cask.cdap.test.AbstractProgramManager.waitForRun(AbstractProgramManager.java:90)
	at co.cask.cdap.app.etl.wrangler.WranglerTest.testWrangler(WranglerTest.java:177)
	at co.cask.cdap.app.etl.wrangler.WranglerTest.testWranglerSpark(WranglerTest.java:92)

JIRA issues

IssueDescriptionStatus
Unknown Issue TypeCDAP-14908Could not obtain issue details from JIRA