Build #106

Build: #106 failed Manual run by Matt Wuenschel

Stages & jobs

  1. Variables

  2. Spinup and Test

Build result summary

Details

Completed
Duration
299 minutes
Labels
None
Revisions
caskdata/cdap-integration-tests
cef5aa513630023c2330ed453c959c1a6885f19b cef5aa513630023c2330ed453c959c1a6885f19b
caskdata/coopr-internal
27d1ed069cb3acb10963f751b2bb0bd4f30a459c 27d1ed069cb3acb10963f751b2bb0bd4f30a459c
Total tests
55
Failing since
#92 (Scheduled with changes by mattwuenschel <mwuenschel@google.com>)

Responsible

This build has been failing since #92
No one has taken responsibility

Tests

Existing test failures 3
Status Test Failing since View job Duration
java.io.IOException: 500: Exception encountered while processing request : null
	at co.cask.cdap.client.util.RESTClient.execute(RESTClient.java:132)
	at co.cask.cdap.client.util.RESTClient.execute(RESTClient.java:91)
	at co.cask.cdap.app.etl.wrangler.WranglerServiceTest.schema(WranglerServiceTest.java:146)
	at co.cask.cdap.app.etl.wrangler.WranglerServiceTest.test(WranglerServiceTest.java:120)
java.util.concurrent.TimeoutException: Timeout occurred. Expected true but found false.
	at co.cask.cdap.common.utils.Tasks.waitFor(Tasks.java:70)
	at co.cask.cdap.common.utils.Tasks.waitFor(Tasks.java:91)
	at co.cask.cdap.common.utils.Tasks.waitFor(Tasks.java:130)
	at co.cask.cdap.test.AbstractProgramManager.waitForRuns(AbstractProgramManager.java:96)
	at co.cask.cdap.test.AbstractProgramManager.waitForRun(AbstractProgramManager.java:90)
	at co.cask.cdap.app.etl.wrangler.WranglerTest.testWrangler(WranglerTest.java:182)
	at co.cask.cdap.app.etl.wrangler.WranglerTest.testWranglerMR(WranglerTest.java:81)
java.util.concurrent.TimeoutException: Timeout occurred. Expected true but found false.
	at co.cask.cdap.common.utils.Tasks.waitFor(Tasks.java:70)
	at co.cask.cdap.common.utils.Tasks.waitFor(Tasks.java:91)
	at co.cask.cdap.common.utils.Tasks.waitFor(Tasks.java:130)
	at co.cask.cdap.test.AbstractProgramManager.waitForRuns(AbstractProgramManager.java:96)
	at co.cask.cdap.test.AbstractProgramManager.waitForRun(AbstractProgramManager.java:90)
	at co.cask.cdap.app.etl.wrangler.WranglerTest.testWrangler(WranglerTest.java:182)
	at co.cask.cdap.app.etl.wrangler.WranglerTest.testWranglerSpark(WranglerTest.java:89)