Build #104

Build: #104 failed Scheduled

Stages & jobs

  1. Variables

  2. Spinup and Test

Build result summary

Details

Completed
Duration
625 minutes
Labels
None
Revisions
caskdata/cdap-integration-tests
cef5aa513630023c2330ed453c959c1a6885f19b cef5aa513630023c2330ed453c959c1a6885f19b
caskdata/coopr-internal
27d1ed069cb3acb10963f751b2bb0bd4f30a459c 27d1ed069cb3acb10963f751b2bb0bd4f30a459c
Total tests
55
Failing since
#92 (Scheduled with changes by mattwuenschel <mwuenschel@google.com>)

Responsible

This build has been failing since #92
No one has taken responsibility

Tests

Existing test failures 3
Status Test Failing since View job Duration
java.io.IOException: 500: Exception encountered while processing request : null
	at co.cask.cdap.client.util.RESTClient.execute(RESTClient.java:132)
	at co.cask.cdap.client.util.RESTClient.execute(RESTClient.java:91)
	at co.cask.cdap.app.etl.wrangler.WranglerServiceTest.schema(WranglerServiceTest.java:146)
	at co.cask.cdap.app.etl.wrangler.WranglerServiceTest.test(WranglerServiceTest.java:120)
java.util.concurrent.TimeoutException: Timeout occurred. Expected true but found false.
	at co.cask.cdap.common.utils.Tasks.waitFor(Tasks.java:70)
	at co.cask.cdap.common.utils.Tasks.waitFor(Tasks.java:91)
	at co.cask.cdap.common.utils.Tasks.waitFor(Tasks.java:130)
	at co.cask.cdap.test.AbstractProgramManager.waitForRuns(AbstractProgramManager.java:96)
	at co.cask.cdap.test.AbstractProgramManager.waitForRun(AbstractProgramManager.java:90)
	at co.cask.cdap.app.etl.wrangler.WranglerTest.testWrangler(WranglerTest.java:182)
	at co.cask.cdap.app.etl.wrangler.WranglerTest.testWranglerMR(WranglerTest.java:81)
java.util.concurrent.TimeoutException: Timeout occurred. Expected true but found false.
	at co.cask.cdap.common.utils.Tasks.waitFor(Tasks.java:70)
	at co.cask.cdap.common.utils.Tasks.waitFor(Tasks.java:91)
	at co.cask.cdap.common.utils.Tasks.waitFor(Tasks.java:130)
	at co.cask.cdap.test.AbstractProgramManager.waitForRuns(AbstractProgramManager.java:96)
	at co.cask.cdap.test.AbstractProgramManager.waitForRun(AbstractProgramManager.java:90)
	at co.cask.cdap.app.etl.wrangler.WranglerTest.testWrangler(WranglerTest.java:182)
	at co.cask.cdap.app.etl.wrangler.WranglerTest.testWranglerSpark(WranglerTest.java:89)
Fixed tests 52
Status Test Failing since View job Duration
Successful KVTableWithProjectionTest testKVTableWithProjection History
Failing since build #103 (Scheduled) Ambari - HDP 2.6 3 mins
Successful StreamTPFSWithProjectionTest testStreamTPFSWithProjection History
Failing since build #103 (Scheduled) Ambari - HDP 2.6 5 mins
Successful BatchAggregatorTest test History
Failing since build #103 (Scheduled) Ambari - HDP 2.6 6 mins
Successful BatchCubeSinkTest test History
Failing since build #103 (Scheduled) Ambari - HDP 2.6 4 mins
Successful BatchJoinerTest testJoinerMR History
Failing since build #103 (Scheduled) Ambari - HDP 2.6 8 mins
Successful BatchJoinerTest testJoinerSpark History
Failing since build #103 (Scheduled) Ambari - HDP 2.6 6 mins
Successful ETLMapReduceTest testTableToTableWithValidations History
Failing since build #103 (Scheduled) Ambari - HDP 2.6 5 mins
Successful ETLMapReduceTest testKVToKV History
Failing since build #103 (Scheduled) Ambari - HDP 2.6 4 mins
Successful ETLMapReduceTest testDAGSchemaChanges History
Failing since build #103 (Scheduled) Ambari - HDP 2.6 4 mins
Successful ETLMapReduceTest testDAGInvalidSchema History
Failing since build #103 (Scheduled) Ambari - HDP 2.6 5 secs
Successful ETLMapReduceTest testDAG History
Failing since build #103 (Scheduled) Ambari - HDP 2.6 4 mins
Successful ExcelInputReaderTest testExcelReaderReprocessFalse History
Failing since build #103 (Scheduled) Ambari - HDP 2.6 4 mins
Successful ExcelInputReaderTest testExcelReader History
Failing since build #103 (Scheduled) Ambari - HDP 2.6 4 mins
Successful HivePluginTest testHivePlugins History
Failing since build #103 (Scheduled) Ambari - HDP 2.6 2 mins
Successful NormalizeTest testNormalizeWithEmptyAttributeValue History
Failing since build #103 (Scheduled) Ambari - HDP 2.6 4 mins
Successful NormalizeTest testNormalize History
Failing since build #103 (Scheduled) Ambari - HDP 2.6 4 mins
Successful RowDenormalizerTest test History
Failing since build #103 (Scheduled) Ambari - HDP 2.6 4 mins
Successful TPFSSinkSourceTest testSpark History
Failing since build #103 (Scheduled) Ambari - HDP 2.6 5 mins
Successful TPFSSinkSourceTest testMR History
Failing since build #103 (Scheduled) Ambari - HDP 2.6 5 mins
Successful ValueMapperTest test History
Failing since build #103 (Scheduled) Ambari - HDP 2.6 5 mins
Successful XMLReaderTest testInvalidNodePathWithMoveAction History
Failing since build #103 (Scheduled) Ambari - HDP 2.6 5 mins
Successful XMLReaderTest testPatternWithDeleteAction History
Failing since build #103 (Scheduled) Ambari - HDP 2.6 5 mins
Successful XMLReaderTest testPreProcessingRequired History
Failing since build #103 (Scheduled) Ambari - HDP 2.6 5 mins
Successful XMLReaderTest testInvalidPatternWithDeleteAction History
Failing since build #103 (Scheduled) Ambari - HDP 2.6 4 mins
Successful XMLReaderTest testPreProcessingNotRequired History
Failing since build #103 (Scheduled) Ambari - HDP 2.6 5 mins
Successful DataStreamsTest testDataStreams History
Failing since build #103 (Scheduled) Ambari - HDP 2.6 3 mins
Successful PermissionTest test History
Failing since build #103 (Scheduled) Ambari - HDP 2.6 12 mins
Successful ReadlessIncrementTest testReadlessIncrementsInMapReduce History
Failing since build #103 (Scheduled) Ambari - HDP 2.6 2 mins
Successful HangingWorkerTest testRestart History
Failing since build #103 (Scheduled) Ambari - HDP 2.6 2 mins
Successful ServiceWorkerTest test History
Failing since build #103 (Scheduled) Ambari - HDP 2.6 2 mins
Successful ApplicationTest test History
Failing since build #103 (Scheduled) Ambari - HDP 2.6 2 mins
Successful ApplicationVersionTest testAppVersionsCreationUpdateDeletion History
Failing since build #103 (Scheduled) Ambari - HDP 2.6 3 mins
Successful DatasetTest test History
Failing since build #103 (Scheduled) Ambari - HDP 2.6 2 mins
Successful NamespaceTest testNamespaces History
Failing since build #103 (Scheduled) Ambari - HDP 2.6 5 secs
Successful NamespacedStreamTest testNamespacedStreams History
Failing since build #103 (Scheduled) Ambari - HDP 2.6 10 secs
Successful StreamTest testNonexistentStreams History
Failing since build #103 (Scheduled) Ambari - HDP 2.6 2 secs
Successful StreamTest testStreams History
Failing since build #103 (Scheduled) Ambari - HDP 2.6 5 secs
Successful ExploreTest test History
Failing since build #103 (Scheduled) Ambari - HDP 2.6 < 1 sec
Successful ExploreTest testSubqueryInWhereClause History
Failing since build #103 (Scheduled) Ambari - HDP 2.6 3 mins
Successful FileSetTest test History
Failing since build #103 (Scheduled) Ambari - HDP 2.6 3 mins
Successful PartitionCorrectorTest test History
Failing since build #103 (Scheduled) Ambari - HDP 2.6 7 mins
Successful PartitionedFileSetUpdateTest test History
Failing since build #103 (Scheduled) Ambari - HDP 2.6 2 mins
Successful ProgramMetadataTest test History
Failing since build #103 (Scheduled) Ambari - HDP 2.6 2 mins
Successful PurchaseMetadataTest testSearchUsingSystemMetadata History
Failing since build #103 (Scheduled) Ambari - HDP 2.6 45 secs
Successful PurchaseMetadataTest testLineage History
Failing since build #103 (Scheduled) Ambari - HDP 2.6 5 mins
Successful PurchaseAudiTest test History
Failing since build #103 (Scheduled) Ambari - HDP 2.6 6 mins
Successful TransactionTimeoutTest testFlowletTimeouts History
Failing since build #103 (Scheduled) Ambari - HDP 2.6 2 mins
Successful WordCountTest test History
Failing since build #103 (Scheduled) Ambari - HDP 2.6 3 mins
Successful OperationalStatsTest testCDAPStats History
Failing since build #103 (Scheduled) Ambari - HDP 2.6 1 sec
Successful RemoteCubeTest test History
Failing since build #103 (Scheduled) Ambari - HDP 2.6 1 min