Build #102

Build: #102 failed Manual run by Matt Wuenschel

Stages & jobs

  1. Variables

  2. Spinup and Test

Build result summary

Details

Completed
Duration
281 minutes
Labels
None
Revisions
caskdata/cdap-integration-tests
cef5aa513630023c2330ed453c959c1a6885f19b cef5aa513630023c2330ed453c959c1a6885f19b
caskdata/coopr-internal
27d1ed069cb3acb10963f751b2bb0bd4f30a459c 27d1ed069cb3acb10963f751b2bb0bd4f30a459c
Total tests
55
Failing since
#92 (Scheduled with changes by mattwuenschel <mwuenschel@google.com>)

Responsible

This build has been failing since #92
No one has taken responsibility

Code commits

caskdata/cdap-integration-tests
Author Commit Message Commit date
mattwuenschel <mwuenschel@google.com> mattwuenschel <mwuenschel@google.com> cef5aa513630023c2330ed453c959c1a6885f19b cef5aa513630023c2330ed453c959c1a6885f19b Merge pull request #969 from caskdata/feature/ambari-version-bump
version bump CDAP for Ambari
mattwuenschel <mwuenschel@google.com> mattwuenschel <mwuenschel@google.com> 7e0ff803d6bc99598edc7981335dc7d6264a6410 7e0ff803d6bc99598edc7981335dc7d6264a6410 version bump CDAP for Ambari

Tests

Existing test failures 3
Status Test Failing since View job Duration
java.io.IOException: 500: Exception encountered while processing request : null
	at co.cask.cdap.client.util.RESTClient.execute(RESTClient.java:132)
	at co.cask.cdap.client.util.RESTClient.execute(RESTClient.java:91)
	at co.cask.cdap.app.etl.wrangler.WranglerServiceTest.schema(WranglerServiceTest.java:146)
	at co.cask.cdap.app.etl.wrangler.WranglerServiceTest.test(WranglerServiceTest.java:120)
java.io.IOException: java.lang.IllegalArgumentException: No plugin of type transform and name Wrangler could be found for stage Wrangler.
	at co.cask.cdap.client.util.RESTClient.upload(RESTClient.java:160)
	at co.cask.cdap.client.ApplicationClient.deploy(ApplicationClient.java:410)
	at co.cask.cdap.test.IntegrationTestManager.deployApplication(IntegrationTestManager.java:203)
	at co.cask.cdap.test.IntegrationTestBase.deployApplication(IntegrationTestBase.java:383)
	at co.cask.cdap.app.etl.wrangler.WranglerTest.testWrangler(WranglerTest.java:177)
	at co.cask.cdap.app.etl.wrangler.WranglerTest.testWranglerMR(WranglerTest.java:81)
java.io.IOException: java.lang.IllegalArgumentException: No plugin of type transform and name Wrangler could be found for stage Wrangler.
	at co.cask.cdap.client.util.RESTClient.upload(RESTClient.java:160)
	at co.cask.cdap.client.ApplicationClient.deploy(ApplicationClient.java:410)
	at co.cask.cdap.test.IntegrationTestManager.deployApplication(IntegrationTestManager.java:203)
	at co.cask.cdap.test.IntegrationTestBase.deployApplication(IntegrationTestBase.java:383)
	at co.cask.cdap.app.etl.wrangler.WranglerTest.testWrangler(WranglerTest.java:177)
	at co.cask.cdap.app.etl.wrangler.WranglerTest.testWranglerSpark(WranglerTest.java:89)
Fixed tests 1
Status Test Failing since View job Duration
Successful ApplicationTest test History
Failing since build #92 (Scheduled with changes by mattwuenschel <mwuenschel@google.com>) Ambari - HDP 2.6 2 mins