Build #13

Build: #13 failed Changes by Ali Anwar and Ali <alianwar@google.com>

Logs

The following logs have been generated by the jobs in this branch.
  • Expand all
  • Collapse all
Job Logs
Collapse Default Job Default Stage Download or View
13-Feb-2019 00:51:59 [INFO] Wrangler Testing Framework ........................ SKIPPED
13-Feb-2019 00:51:59 [INFO] Google Cloud Plugins .............................. SKIPPED
13-Feb-2019 00:51:59 [INFO] Apache Kafka plugins .............................. SKIPPED
13-Feb-2019 00:51:59 [INFO] Apache Kafka plugins common module ................ SKIPPED
13-Feb-2019 00:51:59 [INFO] Apache Kafka 0.8 plugins .......................... SKIPPED
13-Feb-2019 00:51:59 [INFO] Apache Kafka 0.10 plugins ......................... SKIPPED
13-Feb-2019 00:51:59 [INFO] amazon-s3-plugins ................................. SKIPPED
13-Feb-2019 00:51:59 [INFO] Condition Plugin .................................. SKIPPED
13-Feb-2019 00:51:59 [INFO] ------------------------------------------------------------------------
13-Feb-2019 00:51:59 [INFO] BUILD FAILURE
13-Feb-2019 00:51:59 [INFO] ------------------------------------------------------------------------
13-Feb-2019 00:51:59 [INFO] Total time: 11.694s
13-Feb-2019 00:51:59 [INFO] Finished at: Wed Feb 13 00:51:59 UTC 2019
13-Feb-2019 00:52:00 [INFO] Final Memory: 46M/541M
13-Feb-2019 00:52:00 [INFO] ------------------------------------------------------------------------
13-Feb-2019 00:52:00 [ERROR] Failed to execute goal on project hydrator-common: Could not resolve dependencies for project co.cask.hydrator:hydrator-common:jar:2.1.3: Could not find artifact co.cask.cdap:cdap-etl-api:jar:5.1.3 in sonatype (https://oss.sonatype.org/content/groups/public) -> [Help 1]
13-Feb-2019 00:52:00 [ERROR]
13-Feb-2019 00:52:00 [ERROR] To see the full stack trace of the errors, re-run Maven with the -e switch.
13-Feb-2019 00:52:00 [ERROR] Re-run Maven using the -X switch to enable full debug logging.
13-Feb-2019 00:52:00 [ERROR]
13-Feb-2019 00:52:00 [ERROR] For more information about the errors and possible solutions, please read the following articles:
13-Feb-2019 00:52:00 [ERROR] [Help 1] http://cwiki.apache.org/confluence/display/MAVEN/DependencyResolutionException
13-Feb-2019 00:52:00 [ERROR]
13-Feb-2019 00:52:00 [ERROR] After correcting the problems, you can resume the build with the command
13-Feb-2019 00:52:00 [ERROR]   mvn <goals> -rf :hydrator-common