Build #391

Build: #391 failed

Job: Default Job failed

Stages & jobs

  1. Default Stage

Job result summary

Completed
Duration
3 minutes
Agent
bamboo-agent11
Revision
d110d930b58ea6c746dcb00034c92e5f7a05daf8 d110d930b58ea6c746dcb00034c92e5f7a05daf8
Total tests
275
Failing since
#373 (Code changes detected – )
Fixed in
#393 (Code changes detected)

Tests

  • 275 tests in total
  • 7 tests failed
  • 7 failures are new
  • 2 tests were quarantined / skipped
  • 28 seconds taken in total.
New test failures 7
Status Test Duration
Collapse Failed AlertPublisherTest io.cdap.plugin.batch.AlertPublisherTest History
< 1 sec
com.google.inject.CreationException: Unable to create injector, see the following errors:

1) No implementation for io.cdap.cdap.common.namespace.NamespaceAdmin was bound.
  while locating io.cdap.cdap.common.namespace.NamespaceAdmin
    for parameter 1 at io.cdap.cdap.gateway.handlers.NamespaceHttpHandler.<init>(NamespaceHttpHandler.java:57)
  at io.cdap.cdap.app.guice.AppFabricServiceRuntimeModule$AppFabricServiceModule.configure(AppFabricServiceRuntimeModule.java:342) (via modules: com.google.inject.util.Modules$CombinedModule -> io.cdap.cdap.app.guice.AppFabricServiceRuntimeModule$AppFabricServiceModule)

2) No implementation for io.cdap.cdap.common.namespace.NamespaceAdmin was bound.
(635 more lines...)
Collapse Failed BatchPluginsTestSuite io.cdap.plugin.batch.BatchPluginsTestSuite History
< 1 sec
com.google.inject.CreationException: Unable to create injector, see the following errors:

1) No implementation for io.cdap.cdap.common.namespace.NamespaceAdmin was bound.
  while locating io.cdap.cdap.common.namespace.NamespaceAdmin
    for parameter 1 at io.cdap.cdap.gateway.handlers.NamespaceHttpHandler.<init>(NamespaceHttpHandler.java:57)
  at io.cdap.cdap.app.guice.AppFabricServiceRuntimeModule$AppFabricServiceModule.configure(AppFabricServiceRuntimeModule.java:342) (via modules: com.google.inject.util.Modules$CombinedModule -> io.cdap.cdap.app.guice.AppFabricServiceRuntimeModule$AppFabricServiceModule)

2) No implementation for io.cdap.cdap.common.namespace.NamespaceAdmin was bound.
(635 more lines...)
Collapse Failed RowDenormalizerAggregatorTest io.cdap.plugin.batch.aggregator.RowDenormalizerAggregatorTest History
< 1 sec
com.google.inject.CreationException: Unable to create injector, see the following errors:

1) No implementation for io.cdap.cdap.common.namespace.NamespaceAdmin was bound.
  while locating io.cdap.cdap.common.namespace.NamespaceAdmin
    for parameter 1 at io.cdap.cdap.gateway.handlers.NamespaceHttpHandler.<init>(NamespaceHttpHandler.java:57)
  at io.cdap.cdap.app.guice.AppFabricServiceRuntimeModule$AppFabricServiceModule.configure(AppFabricServiceRuntimeModule.java:342) (via modules: com.google.inject.util.Modules$CombinedModule -> io.cdap.cdap.app.guice.AppFabricServiceRuntimeModule$AppFabricServiceModule)

2) No implementation for io.cdap.cdap.common.namespace.NamespaceAdmin was bound.
(635 more lines...)
Collapse Failed BatchCubeSinkTest io.cdap.plugin.batch.sink.BatchCubeSinkTest History
< 1 sec
com.google.inject.CreationException: Unable to create injector, see the following errors:

1) No implementation for io.cdap.cdap.common.namespace.NamespaceAdmin was bound.
  while locating io.cdap.cdap.common.namespace.NamespaceAdmin
    for parameter 1 at io.cdap.cdap.gateway.handlers.NamespaceHttpHandler.<init>(NamespaceHttpHandler.java:57)
  at io.cdap.cdap.app.guice.AppFabricServiceRuntimeModule$AppFabricServiceModule.configure(AppFabricServiceRuntimeModule.java:342) (via modules: com.google.inject.util.Modules$CombinedModule -> io.cdap.cdap.app.guice.AppFabricServiceRuntimeModule$AppFabricServiceModule)

2) No implementation for io.cdap.cdap.common.namespace.NamespaceAdmin was bound.
(635 more lines...)
Collapse Failed TableSinkTest io.cdap.plugin.batch.sink.TableSinkTest History
< 1 sec
com.google.inject.CreationException: Unable to create injector, see the following errors:

1) No implementation for io.cdap.cdap.common.namespace.NamespaceAdmin was bound.
  while locating io.cdap.cdap.common.namespace.NamespaceAdmin
    for parameter 1 at io.cdap.cdap.gateway.handlers.NamespaceHttpHandler.<init>(NamespaceHttpHandler.java:57)
  at io.cdap.cdap.app.guice.AppFabricServiceRuntimeModule$AppFabricServiceModule.configure(AppFabricServiceRuntimeModule.java:342) (via modules: com.google.inject.util.Modules$CombinedModule -> io.cdap.cdap.app.guice.AppFabricServiceRuntimeModule$AppFabricServiceModule)

2) No implementation for io.cdap.cdap.common.namespace.NamespaceAdmin was bound.
(635 more lines...)
Collapse Failed FileBatchSourceTest io.cdap.plugin.batch.source.FileBatchSourceTest History
< 1 sec
com.google.inject.CreationException: Unable to create injector, see the following errors:

1) No implementation for io.cdap.cdap.common.namespace.NamespaceAdmin was bound.
  while locating io.cdap.cdap.common.namespace.NamespaceAdmin
    for parameter 1 at io.cdap.cdap.gateway.handlers.NamespaceHttpHandler.<init>(NamespaceHttpHandler.java:57)
  at io.cdap.cdap.app.guice.AppFabricServiceRuntimeModule$AppFabricServiceModule.configure(AppFabricServiceRuntimeModule.java:342) (via modules: com.google.inject.util.Modules$CombinedModule -> io.cdap.cdap.app.guice.AppFabricServiceRuntimeModule$AppFabricServiceModule)

2) No implementation for io.cdap.cdap.common.namespace.NamespaceAdmin was bound.
(640 more lines...)
Collapse Failed SnapshotFileSetTest io.cdap.plugin.common.SnapshotFileSetTest History
< 1 sec
com.google.inject.CreationException: Unable to create injector, see the following errors:

1) No implementation for io.cdap.cdap.common.namespace.NamespaceAdmin was bound.
  while locating io.cdap.cdap.common.namespace.NamespaceAdmin
    for parameter 1 at io.cdap.cdap.gateway.handlers.NamespaceHttpHandler.<init>(NamespaceHttpHandler.java:57)
  at io.cdap.cdap.app.guice.AppFabricServiceRuntimeModule$AppFabricServiceModule.configure(AppFabricServiceRuntimeModule.java:342) (via modules: com.google.inject.util.Modules$CombinedModule -> io.cdap.cdap.app.guice.AppFabricServiceRuntimeModule$AppFabricServiceModule)

2) No implementation for io.cdap.cdap.common.namespace.NamespaceAdmin was bound.
(630 more lines...)

Error summary

The build generated some errors. See the full build log for more details.

Java HotSpot(TM) 64-Bit Server VM warning: ignoring option MaxPermSize=128m; support was removed in 8.0