Build #373

Build: #373 failed

Job: Default Job failed

Stages & jobs

  1. Default Stage

Job result summary

Completed
Duration
22 minutes
Agent
bamboo-agent09
Revision
40937a5b0b2718b85af0f39421488c3228f072f8 40937a5b0b2718b85af0f39421488c3228f072f8
Total tests
288
Fixed in
#393 (Code changes detected)

Tests

  • 288 tests in total
  • 3 tests failed
  • 3 failures are new
  • 2 tests were quarantined / skipped
  • 8 minutes taken in total.
New test failures 3
Status Test Duration
Collapse Failed DedupTestRun testDedup History
8 secs
java.lang.AssertionError: Expected records expected:<2> but was:<0>
	at org.junit.Assert.fail(Assert.java:88)
	at org.junit.Assert.failNotEquals(Assert.java:743)
	at org.junit.Assert.assertEquals(Assert.java:118)
	at org.junit.Assert.assertEquals(Assert.java:555)
	at io.cdap.plugin.batch.aggregator.DedupTestRun.testHelper(DedupTestRun.java:111)
	at io.cdap.plugin.batch.aggregator.DedupTestRun.testDedup(DedupTestRun.java:130)
Collapse Failed DedupTestRun testDedupWithMacro History
8 secs
java.lang.AssertionError: Expected records expected:<2> but was:<0>
	at org.junit.Assert.fail(Assert.java:88)
	at org.junit.Assert.failNotEquals(Assert.java:743)
	at org.junit.Assert.assertEquals(Assert.java:118)
	at org.junit.Assert.assertEquals(Assert.java:555)
	at io.cdap.plugin.batch.aggregator.DedupTestRun.testHelper(DedupTestRun.java:111)
	at io.cdap.plugin.batch.aggregator.DedupTestRun.testDedupWithMacro(DedupTestRun.java:138)
Collapse Failed GroupByTestRun testGroupBy History
14 secs
java.lang.NullPointerException: null
	at java.util.Objects.requireNonNull(Objects.java:203)
	at io.cdap.plugin.batch.aggregator.GroupByTestRun.testGroupBy(GroupByTestRun.java:235)
	at io.cdap.plugin.batch.aggregator.GroupByTestRun.testGroupBy(GroupByTestRun.java:64)

Error summary

The build generated some errors. See the full build log for more details.

Java HotSpot(TM) 64-Bit Server VM warning: ignoring option MaxPermSize=128m; support was removed in 8.0