Build #227

Build: #227 failed

Job: Default Job failed

Stages & jobs

  1. Default Stage

Job result summary

Completed
Duration
23 minutes
Agent
bamboo-agent12
Revision
4a8f59b84346b71be87a0357b7343571e5869043 4a8f59b84346b71be87a0357b7343571e5869043
Total tests
218
Fixed in
#229 (Code changes detected)

Tests

  • 218 tests in total
  • 7 tests failed
  • 7 failures are new
  • 2 tests were quarantined / skipped
  • 8 minutes taken in total.
New test failures 7
Status Test Duration
Collapse Failed DBSinkTestRun testNullFields History
1 sec
java.lang.IllegalStateException: Expected 200 OK, got 400 Bad Request. Error: Failed to deploy app
	at co.cask.cdap.internal.AppFabricClient.verifyResponse(AppFabricClient.java:425)
	at co.cask.cdap.internal.AppFabricClient.deployApplication(AppFabricClient.java:491)
	at co.cask.cdap.test.UnitTestManager.deployApplication(UnitTestManager.java:192)
	at co.cask.cdap.test.TestBase.deployApplication(TestBase.java:582)
	at co.cask.hydrator.plugin.DatabasePluginTestBase.deployETL(DatabasePluginTestBase.java:280)
	at co.cask.hydrator.plugin.db.batch.sink.DBSinkTestRun.testNullFields(DBSinkTestRun.java:129)
Collapse Failed DBSourceTestRun testDBMacroSupport History
< 1 sec
java.lang.IllegalStateException: Expected 200 OK, got 400 Bad Request. Error: Failed to deploy app
	at co.cask.cdap.internal.AppFabricClient.verifyResponse(AppFabricClient.java:425)
	at co.cask.cdap.internal.AppFabricClient.deployApplication(AppFabricClient.java:491)
	at co.cask.cdap.test.UnitTestManager.deployApplication(UnitTestManager.java:192)
	at co.cask.cdap.test.TestBase.deployApplication(TestBase.java:582)
	at co.cask.hydrator.plugin.DatabasePluginTestBase.deployETL(DatabasePluginTestBase.java:280)
	at co.cask.hydrator.plugin.db.batch.sink.DBSourceTestRun.testDBMacroSupport(DBSourceTestRun.java:82)
Collapse Failed DBSourceTestRun testDBSource History
< 1 sec
java.lang.IllegalStateException: Expected 200 OK, got 400 Bad Request. Error: Failed to deploy app
	at co.cask.cdap.internal.AppFabricClient.verifyResponse(AppFabricClient.java:425)
	at co.cask.cdap.internal.AppFabricClient.deployApplication(AppFabricClient.java:491)
	at co.cask.cdap.test.UnitTestManager.deployApplication(UnitTestManager.java:192)
	at co.cask.cdap.test.TestBase.deployApplication(TestBase.java:582)
	at co.cask.hydrator.plugin.DatabasePluginTestBase.deployETL(DatabasePluginTestBase.java:280)
	at co.cask.hydrator.plugin.db.batch.sink.DBSourceTestRun.testDBSource(DBSourceTestRun.java:115)
Collapse Failed DBSourceTestRun testDBSourceWithLowerCaseColNames History
< 1 sec
java.lang.IllegalStateException: Expected 200 OK, got 400 Bad Request. Error: Failed to deploy app
	at co.cask.cdap.internal.AppFabricClient.verifyResponse(AppFabricClient.java:425)
	at co.cask.cdap.internal.AppFabricClient.deployApplication(AppFabricClient.java:491)
	at co.cask.cdap.test.UnitTestManager.deployApplication(UnitTestManager.java:192)
	at co.cask.cdap.test.TestBase.deployApplication(TestBase.java:582)
	at co.cask.hydrator.plugin.DatabasePluginTestBase.deployETL(DatabasePluginTestBase.java:280)
	at co.cask.hydrator.plugin.db.batch.sink.DBSourceTestRun.testDBSourceWithLowerCaseColNames(DBSourceTestRun.java:204)
Collapse Failed DBSourceTestRun testDbSourceMultipleTables History
< 1 sec
java.lang.IllegalStateException: Expected 200 OK, got 400 Bad Request. Error: Failed to deploy app
	at co.cask.cdap.internal.AppFabricClient.verifyResponse(AppFabricClient.java:425)
	at co.cask.cdap.internal.AppFabricClient.deployApplication(AppFabricClient.java:491)
	at co.cask.cdap.test.UnitTestManager.deployApplication(UnitTestManager.java:192)
	at co.cask.cdap.test.TestBase.deployApplication(TestBase.java:582)
	at co.cask.hydrator.plugin.DatabasePluginTestBase.deployETL(DatabasePluginTestBase.java:280)
	at co.cask.hydrator.plugin.db.batch.sink.DBSourceTestRun.testDbSourceMultipleTables(DBSourceTestRun.java:247)
Collapse Failed DBSourceTestRun testNonExistentDBTable History
< 1 sec
java.lang.IllegalStateException: Expected 200 OK, got 400 Bad Request. Error: Failed to deploy app
	at co.cask.cdap.internal.AppFabricClient.verifyResponse(AppFabricClient.java:425)
	at co.cask.cdap.internal.AppFabricClient.deployApplication(AppFabricClient.java:491)
	at co.cask.cdap.test.UnitTestManager.deployApplication(UnitTestManager.java:192)
	at co.cask.cdap.test.TestBase.deployApplication(TestBase.java:582)
	at co.cask.hydrator.plugin.DatabasePluginTestBase.assertRuntimeFailure(DatabasePluginTestBase.java:262)
	at co.cask.hydrator.plugin.db.batch.sink.DBSourceTestRun.testNonExistentDBTable(DBSourceTestRun.java:353)
Collapse Failed DBSourceTestRun testUserNamePasswordCombinations History
< 1 sec
java.lang.IllegalStateException: Expected 200 OK, got 400 Bad Request. Error: Failed to deploy app
	at co.cask.cdap.internal.AppFabricClient.verifyResponse(AppFabricClient.java:425)
	at co.cask.cdap.internal.AppFabricClient.deployApplication(AppFabricClient.java:491)
	at co.cask.cdap.test.UnitTestManager.deployApplication(UnitTestManager.java:192)
	at co.cask.cdap.test.TestBase.deployApplication(TestBase.java:582)
	at co.cask.hydrator.plugin.db.batch.sink.DBSourceTestRun.testUserNamePasswordCombinations(DBSourceTestRun.java:294)

Error summary

The build generated some errors. See the full build log for more details.

Java HotSpot(TM) 64-Bit Server VM warning: ignoring option MaxPermSize=128m; support was removed in 8.0