Build #219

Build: #219 failed

Job: Default Job failed

Stages & jobs

  1. Default Stage

Job result summary

Completed
Duration
2 minutes
Agent
bamboo-agent02
Revision
cf082e4ed4d2a6acb0736c17d1223f5f5ceb5b28 cf082e4ed4d2a6acb0736c17d1223f5f5ceb5b28
Total tests
142
Fixed in
#221 (Code changes detected)

Tests

  • 142 tests in total
  • 7 tests failed
  • 7 failures are new
  • 2 tests were quarantined / skipped
  • 12 seconds taken in total.
New test failures 7
Status Test Duration
Collapse Failed AlertPublisherTest co.cask.hydrator.plugin.batch.AlertPublisherTest History
< 1 sec
java.lang.IllegalArgumentException: Failed to determine required number of entity parts needed for co.cask.cdap.proto.id.StreamId. Please make sure its a valid EntityId class for authorization enforcement
	at co.cask.cdap.common.security.AuthEnforceUtil.getEntityIdPartsCount(AuthEnforceUtil.java:130)
	at co.cask.cdap.common.security.AuthEnforceRewriter$AuthEnforceAnnotationVisitor$1.verifyEntityParts(AuthEnforceRewriter.java:317)
	at co.cask.cdap.common.security.AuthEnforceRewriter$AuthEnforceAnnotationVisitor$1.visitEnd(AuthEnforceRewriter.java:286)
	at org.objectweb.asm.ClassReader.b(Unknown Source)
	at org.objectweb.asm.ClassReader.accept(Unknown Source)
	at org.objectweb.asm.ClassReader.accept(Unknown Source)
	at co.cask.cdap.common.security.AuthEnforceRewriter.rewriteClass(AuthEnforceRewriter.java:151)
(43 more lines...)
Collapse Failed BatchPluginsTestSuite co.cask.hydrator.plugin.batch.BatchPluginsTestSuite History
< 1 sec
java.lang.IllegalArgumentException: Failed to determine required number of entity parts needed for co.cask.cdap.proto.id.StreamId. Please make sure its a valid EntityId class for authorization enforcement
	at co.cask.cdap.common.security.AuthEnforceUtil.getEntityIdPartsCount(AuthEnforceUtil.java:130)
	at co.cask.cdap.common.security.AuthEnforceRewriter$AuthEnforceAnnotationVisitor$1.verifyEntityParts(AuthEnforceRewriter.java:317)
	at co.cask.cdap.common.security.AuthEnforceRewriter$AuthEnforceAnnotationVisitor$1.visitEnd(AuthEnforceRewriter.java:286)
	at org.objectweb.asm.ClassReader.b(Unknown Source)
	at org.objectweb.asm.ClassReader.accept(Unknown Source)
	at org.objectweb.asm.ClassReader.accept(Unknown Source)
	at co.cask.cdap.common.security.AuthEnforceRewriter.rewriteClass(AuthEnforceRewriter.java:151)
(43 more lines...)
Collapse Failed RowDenormalizerAggregatorTest co.cask.hydrator.plugin.batch.aggregator.RowDenormalizerAggregatorTest History
< 1 sec
java.lang.IllegalArgumentException: Failed to determine required number of entity parts needed for co.cask.cdap.proto.id.StreamId. Please make sure its a valid EntityId class for authorization enforcement
	at co.cask.cdap.common.security.AuthEnforceUtil.getEntityIdPartsCount(AuthEnforceUtil.java:130)
	at co.cask.cdap.common.security.AuthEnforceRewriter$AuthEnforceAnnotationVisitor$1.verifyEntityParts(AuthEnforceRewriter.java:317)
	at co.cask.cdap.common.security.AuthEnforceRewriter$AuthEnforceAnnotationVisitor$1.visitEnd(AuthEnforceRewriter.java:286)
	at org.objectweb.asm.ClassReader.b(Unknown Source)
	at org.objectweb.asm.ClassReader.accept(Unknown Source)
	at org.objectweb.asm.ClassReader.accept(Unknown Source)
	at co.cask.cdap.common.security.AuthEnforceRewriter.rewriteClass(AuthEnforceRewriter.java:151)
(43 more lines...)
Collapse Failed BatchCubeSinkTest co.cask.hydrator.plugin.batch.sink.BatchCubeSinkTest History
< 1 sec
java.lang.IllegalArgumentException: Failed to determine required number of entity parts needed for co.cask.cdap.proto.id.StreamId. Please make sure its a valid EntityId class for authorization enforcement
	at co.cask.cdap.common.security.AuthEnforceUtil.getEntityIdPartsCount(AuthEnforceUtil.java:130)
	at co.cask.cdap.common.security.AuthEnforceRewriter$AuthEnforceAnnotationVisitor$1.verifyEntityParts(AuthEnforceRewriter.java:317)
	at co.cask.cdap.common.security.AuthEnforceRewriter$AuthEnforceAnnotationVisitor$1.visitEnd(AuthEnforceRewriter.java:286)
	at org.objectweb.asm.ClassReader.b(Unknown Source)
	at org.objectweb.asm.ClassReader.accept(Unknown Source)
	at org.objectweb.asm.ClassReader.accept(Unknown Source)
	at co.cask.cdap.common.security.AuthEnforceRewriter.rewriteClass(AuthEnforceRewriter.java:151)
(43 more lines...)
Collapse Failed TableSinkTest co.cask.hydrator.plugin.batch.sink.TableSinkTest History
< 1 sec
java.lang.IllegalArgumentException: Failed to determine required number of entity parts needed for co.cask.cdap.proto.id.StreamId. Please make sure its a valid EntityId class for authorization enforcement
	at co.cask.cdap.common.security.AuthEnforceUtil.getEntityIdPartsCount(AuthEnforceUtil.java:130)
	at co.cask.cdap.common.security.AuthEnforceRewriter$AuthEnforceAnnotationVisitor$1.verifyEntityParts(AuthEnforceRewriter.java:317)
	at co.cask.cdap.common.security.AuthEnforceRewriter$AuthEnforceAnnotationVisitor$1.visitEnd(AuthEnforceRewriter.java:286)
	at org.objectweb.asm.ClassReader.b(Unknown Source)
	at org.objectweb.asm.ClassReader.accept(Unknown Source)
	at org.objectweb.asm.ClassReader.accept(Unknown Source)
	at co.cask.cdap.common.security.AuthEnforceRewriter.rewriteClass(AuthEnforceRewriter.java:151)
(43 more lines...)
Collapse Failed FileBatchSourceTest co.cask.hydrator.plugin.batch.source.FileBatchSourceTest History
< 1 sec
java.lang.IllegalArgumentException: Failed to determine required number of entity parts needed for co.cask.cdap.proto.id.StreamId. Please make sure its a valid EntityId class for authorization enforcement
	at co.cask.cdap.common.security.AuthEnforceUtil.getEntityIdPartsCount(AuthEnforceUtil.java:130)
	at co.cask.cdap.common.security.AuthEnforceRewriter$AuthEnforceAnnotationVisitor$1.verifyEntityParts(AuthEnforceRewriter.java:317)
	at co.cask.cdap.common.security.AuthEnforceRewriter$AuthEnforceAnnotationVisitor$1.visitEnd(AuthEnforceRewriter.java:286)
	at org.objectweb.asm.ClassReader.b(Unknown Source)
	at org.objectweb.asm.ClassReader.accept(Unknown Source)
	at org.objectweb.asm.ClassReader.accept(Unknown Source)
	at co.cask.cdap.common.security.AuthEnforceRewriter.rewriteClass(AuthEnforceRewriter.java:151)
(44 more lines...)
Collapse Failed SnapshotFileSetTest co.cask.hydrator.plugin.common.SnapshotFileSetTest History
< 1 sec
java.lang.IllegalArgumentException: Failed to determine required number of entity parts needed for co.cask.cdap.proto.id.StreamId. Please make sure its a valid EntityId class for authorization enforcement
	at co.cask.cdap.common.security.AuthEnforceUtil.getEntityIdPartsCount(AuthEnforceUtil.java:130)
	at co.cask.cdap.common.security.AuthEnforceRewriter$AuthEnforceAnnotationVisitor$1.verifyEntityParts(AuthEnforceRewriter.java:317)
	at co.cask.cdap.common.security.AuthEnforceRewriter$AuthEnforceAnnotationVisitor$1.visitEnd(AuthEnforceRewriter.java:286)
	at org.objectweb.asm.ClassReader.b(Unknown Source)
	at org.objectweb.asm.ClassReader.accept(Unknown Source)
	at org.objectweb.asm.ClassReader.accept(Unknown Source)
	at co.cask.cdap.common.security.AuthEnforceRewriter.rewriteClass(AuthEnforceRewriter.java:151)
(42 more lines...)

Error summary

The build generated some errors. See the full build log for more details.

Java HotSpot(TM) 64-Bit Server VM warning: ignoring option MaxPermSize=128m; support was removed in 8.0