Build #1

Build: #1 failed

Job: Default Job failed

Stages & jobs

  1. Default Stage

Test results

  • 178 tests in total
  • 15 tests failed
  • 15 failures are new
  • 4 minutes taken in total.

Build 1 has the following 15 errors: 15 new failure(s) occurred since the previous build.

New test failures 15
Status Test Duration
Collapse Failed ETLMapReduceTestRun testDAG History
< 1 sec
java.lang.IllegalStateException: Expected 200 OK, got 404 Not Found. Error: Failed to deploy app
	at co.cask.cdap.internal.AppFabricClient.verifyResponse(AppFabricClient.java:370)
	at co.cask.cdap.internal.AppFabricClient.deployApplication(AppFabricClient.java:428)
	at co.cask.cdap.test.UnitTestManager.deployApplication(UnitTestManager.java:199)
	at co.cask.cdap.test.TestBase.deployApplication(TestBase.java:522)
	at co.cask.hydrator.plugin.batch.ETLMapReduceTestRun.testDAG(ETLMapReduceTestRun.java:198)
Collapse Failed ETLMapReduceTestRun testFiletoMultipleTPFS History
< 1 sec
java.lang.IllegalStateException: Expected 200 OK, got 404 Not Found. Error: Failed to deploy app
	at co.cask.cdap.internal.AppFabricClient.verifyResponse(AppFabricClient.java:370)
	at co.cask.cdap.internal.AppFabricClient.deployApplication(AppFabricClient.java:428)
	at co.cask.cdap.test.UnitTestManager.deployApplication(UnitTestManager.java:199)
	at co.cask.cdap.test.TestBase.deployApplication(TestBase.java:522)
	at co.cask.hydrator.plugin.batch.ETLMapReduceTestRun.testFiletoMultipleTPFS(ETLMapReduceTestRun.java:462)
Collapse Failed ETLMapReduceTestRun testKVToKV History
< 1 sec
java.lang.IllegalStateException: Expected 200 OK, got 404 Not Found. Error: Failed to deploy app
	at co.cask.cdap.internal.AppFabricClient.verifyResponse(AppFabricClient.java:370)
	at co.cask.cdap.internal.AppFabricClient.deployApplication(AppFabricClient.java:428)
	at co.cask.cdap.test.UnitTestManager.deployApplication(UnitTestManager.java:199)
	at co.cask.cdap.test.TestBase.deployApplication(TestBase.java:522)
	at co.cask.hydrator.plugin.batch.ETLMapReduceTestRun.testKVToKV(ETLMapReduceTestRun.java:119)
Collapse Failed ETLMapReduceTestRun testS3toTPFS History
< 1 sec
java.lang.IllegalStateException: Expected 200 OK, got 404 Not Found. Error: Failed to deploy app
	at co.cask.cdap.internal.AppFabricClient.verifyResponse(AppFabricClient.java:370)
	at co.cask.cdap.internal.AppFabricClient.deployApplication(AppFabricClient.java:428)
	at co.cask.cdap.test.UnitTestManager.deployApplication(UnitTestManager.java:199)
	at co.cask.cdap.test.TestBase.deployApplication(TestBase.java:522)
	at co.cask.hydrator.plugin.batch.ETLMapReduceTestRun.testS3toTPFS(ETLMapReduceTestRun.java:401)
Collapse Failed ETLMapReduceTestRun testTableToTableWithValidations History
< 1 sec
java.lang.IllegalStateException: Expected 200 OK, got 404 Not Found. Error: Failed to deploy app
	at co.cask.cdap.internal.AppFabricClient.verifyResponse(AppFabricClient.java:370)
	at co.cask.cdap.internal.AppFabricClient.deployApplication(AppFabricClient.java:428)
	at co.cask.cdap.test.UnitTestManager.deployApplication(UnitTestManager.java:199)
	at co.cask.cdap.test.TestBase.deployApplication(TestBase.java:522)
	at co.cask.hydrator.plugin.batch.ETLMapReduceTestRun.testTableToTableWithValidations(ETLMapReduceTestRun.java:300)
Collapse Failed ETLStreamConversionTestRun testStreamConversionTPFSAvroSink History
< 1 sec
java.lang.IllegalArgumentException: Home directory /tmp/HYP-BAD-JOB1/junit7805353154804160275/junit3875758594414347520/namespaces/default for namespace namespace:default not found
	at com.google.common.base.Preconditions.checkArgument(Preconditions.java:119)
	at co.cask.cdap.data2.transaction.stream.FileStreamAdmin.assertNamespaceHomeExists(FileStreamAdmin.java:459)
	at co.cask.cdap.data2.transaction.stream.FileStreamAdmin.access$900(FileStreamAdmin.java:93)
	at co.cask.cdap.data2.transaction.stream.FileStreamAdmin$8.call(FileStreamAdmin.java:399)
	at co.cask.cdap.data2.transaction.stream.FileStreamAdmin$8.call(FileStreamAdmin.java:396)
	at co.cask.cdap.data2.security.ImpersonationUtils$1.run(ImpersonationUtils.java:46)
	at java.security.AccessController.doPrivileged(Native Method)
(8 more lines...)
Collapse Failed ETLStreamConversionTestRun testStreamConversionTPFSParquetSink History
< 1 sec
java.lang.IllegalArgumentException: Home directory /tmp/HYP-BAD-JOB1/junit7805353154804160275/junit3875758594414347520/namespaces/default for namespace namespace:default not found
	at com.google.common.base.Preconditions.checkArgument(Preconditions.java:119)
	at co.cask.cdap.data2.transaction.stream.FileStreamAdmin.assertNamespaceHomeExists(FileStreamAdmin.java:459)
	at co.cask.cdap.data2.transaction.stream.FileStreamAdmin.access$900(FileStreamAdmin.java:93)
	at co.cask.cdap.data2.transaction.stream.FileStreamAdmin$8.call(FileStreamAdmin.java:399)
	at co.cask.cdap.data2.transaction.stream.FileStreamAdmin$8.call(FileStreamAdmin.java:396)
	at co.cask.cdap.data2.security.ImpersonationUtils$1.run(ImpersonationUtils.java:46)
	at java.security.AccessController.doPrivileged(Native Method)
(8 more lines...)
Collapse Failed ETLTPFSTestRun testAvroSourceConversionToAvroSink History
5 secs
java.lang.IllegalStateException: Expected 200 OK, got 404 Not Found. Error: Failed to deploy app
	at co.cask.cdap.internal.AppFabricClient.verifyResponse(AppFabricClient.java:370)
	at co.cask.cdap.internal.AppFabricClient.deployApplication(AppFabricClient.java:428)
	at co.cask.cdap.test.UnitTestManager.deployApplication(UnitTestManager.java:199)
	at co.cask.cdap.test.TestBase.deployApplication(TestBase.java:522)
	at co.cask.hydrator.plugin.batch.ETLTPFSTestRun.testAvroSourceConversionToAvroSink(ETLTPFSTestRun.java:207)
Collapse Failed ETLTPFSTestRun testParquet History
< 1 sec
java.lang.IllegalStateException: Expected 200 OK, got 404 Not Found. Error: Failed to deploy app
	at co.cask.cdap.internal.AppFabricClient.verifyResponse(AppFabricClient.java:370)
	at co.cask.cdap.internal.AppFabricClient.deployApplication(AppFabricClient.java:428)
	at co.cask.cdap.test.UnitTestManager.deployApplication(UnitTestManager.java:199)
	at co.cask.cdap.test.TestBase.deployApplication(TestBase.java:522)
	at co.cask.hydrator.plugin.batch.ETLTPFSTestRun.testParquet(ETLTPFSTestRun.java:255)
Collapse Failed ETLTPFSTestRun testPartitionOffsetAndCleanup History
< 1 sec
java.lang.IllegalStateException: Expected 200 OK, got 404 Not Found. Error: Failed to deploy app
	at co.cask.cdap.internal.AppFabricClient.verifyResponse(AppFabricClient.java:370)
	at co.cask.cdap.internal.AppFabricClient.deployApplication(AppFabricClient.java:428)
	at co.cask.cdap.test.UnitTestManager.deployApplication(UnitTestManager.java:199)
	at co.cask.cdap.test.TestBase.deployApplication(TestBase.java:522)
	at co.cask.hydrator.plugin.batch.ETLTPFSTestRun.testPartitionOffsetAndCleanup(ETLTPFSTestRun.java:98)
Collapse Failed EmailActionTestRun testEmailAction History
< 1 sec
java.lang.IllegalStateException: Expected 200 OK, got 404 Not Found. Error: Failed to deploy app
	at co.cask.cdap.internal.AppFabricClient.verifyResponse(AppFabricClient.java:370)
	at co.cask.cdap.internal.AppFabricClient.deployApplication(AppFabricClient.java:428)
	at co.cask.cdap.test.UnitTestManager.deployApplication(UnitTestManager.java:199)
	at co.cask.cdap.test.TestBase.deployApplication(TestBase.java:522)
	at co.cask.hydrator.plugin.batch.action.EmailActionTestRun.testEmailAction(EmailActionTestRun.java:83)
Collapse Failed DedupTestRun testDedup History
< 1 sec
java.lang.IllegalStateException: Expected 200 OK, got 404 Not Found. Error: Failed to deploy app
	at co.cask.cdap.internal.AppFabricClient.verifyResponse(AppFabricClient.java:370)
	at co.cask.cdap.internal.AppFabricClient.deployApplication(AppFabricClient.java:428)
	at co.cask.cdap.test.UnitTestManager.deployApplication(UnitTestManager.java:199)
	at co.cask.cdap.test.TestBase.deployApplication(TestBase.java:522)
	at co.cask.hydrator.plugin.batch.aggregator.DedupTestRun.testDedup(DedupTestRun.java:88)
Collapse Failed GroupByTestRun testGroupBy History
< 1 sec
java.lang.IllegalStateException: Expected 200 OK, got 404 Not Found. Error: Failed to deploy app
	at co.cask.cdap.internal.AppFabricClient.verifyResponse(AppFabricClient.java:370)
	at co.cask.cdap.internal.AppFabricClient.deployApplication(AppFabricClient.java:428)
	at co.cask.cdap.test.UnitTestManager.deployApplication(UnitTestManager.java:199)
	at co.cask.cdap.test.TestBase.deployApplication(TestBase.java:522)
	at co.cask.hydrator.plugin.batch.aggregator.GroupByTestRun.testGroupBy(GroupByTestRun.java:136)
Collapse Failed ExcelInputReaderTest testWithErrorRecord History
10 secs
java.lang.AssertionError: Expected records expected:<6> but was:<0>
	at org.junit.Assert.fail(Assert.java:88)
	at org.junit.Assert.failNotEquals(Assert.java:743)
	at org.junit.Assert.assertEquals(Assert.java:118)
	at org.junit.Assert.assertEquals(Assert.java:555)
	at co.cask.hydrator.plugin.batch.source.ExcelInputReaderTest.testWithErrorRecord(ExcelInputReaderTest.java:355)
Collapse Failed XMLReaderBatchSourceTest testXMLReaderWithNoXMLPreProcessingRequired History
8 secs
java.lang.AssertionError: expected:<1> but was:<0>
	at org.junit.Assert.fail(Assert.java:88)
	at org.junit.Assert.failNotEquals(Assert.java:743)
	at org.junit.Assert.assertEquals(Assert.java:118)
	at org.junit.Assert.assertEquals(Assert.java:555)
	at org.junit.Assert.assertEquals(Assert.java:542)
	at co.cask.hydrator.plugin.batch.source.XMLReaderBatchSourceTest.testXMLReaderWithNoXMLPreProcessingRequired(XMLReaderBatchSourceTest.java:234)