Build #391

Build result summary

Details

Completed
Duration
3 minutes
Labels
None
Agent
bamboo-agent11
Revision
d110d930b58ea6c746dcb00034c92e5f7a05daf8 d110d930b58ea6c746dcb00034c92e5f7a05daf8
Total tests
275
Failing since
#373 (Changes by Vitalii Tymchyshyn)
Fixed in
#393 (Changes by greeshmaswaminathan <greeshmaswaminathan@users.noreply.github.com> and Greeshma Swaminathan)

Responsible

Code commits

Author Commit Message Commit date
seanzhougoogle <69162095+seanzhougoogle@users.noreply.github.com> seanzhougoogle <69162095+seanzhougoogle@users.noreply.github.com> d110d930b58ea6c746dcb00034c92e5f7a05daf8 d110d930b58ea6c746dcb00034c92e5f7a05daf8 Merge pull request #1414 from cdapio/fix/NPE
Sean Zhou Sean Zhou 63ca321ce5390b2f1ac28969592a0279fde83a32 63ca321ce5390b2f1ac28969592a0279fde83a32 address comments
Sean Zhou Sean Zhou 3dd71b79a67d4b561cad5a255090e6e1bd7a7de3 3dd71b79a67d4b561cad5a255090e6e1bd7a7de3 fix NPE

Tests

New test failures 7
Status Test View job Duration
Collapse Failed AlertPublisherTest io.cdap.plugin.batch.AlertPublisherTest History
Default Job < 1 sec
com.google.inject.CreationException: Unable to create injector, see the following errors:

1) No implementation for io.cdap.cdap.common.namespace.NamespaceAdmin was bound.
  while locating io.cdap.cdap.common.namespace.NamespaceAdmin
    for parameter 1 at io.cdap.cdap.gateway.handlers.NamespaceHttpHandler.<init>(NamespaceHttpHandler.java:57)
  at io.cdap.cdap.app.guice.AppFabricServiceRuntimeModule$AppFabricServiceModule.configure(AppFabricServiceRuntimeModule.java:342) (via modules: com.google.inject.util.Modules$CombinedModule -> io.cdap.cdap.app.guice.AppFabricServiceRuntimeModule$AppFabricServiceModule)

2) No implementation for io.cdap.cdap.common.namespace.NamespaceAdmin was bound.
(635 more lines...)
Collapse Failed BatchPluginsTestSuite io.cdap.plugin.batch.BatchPluginsTestSuite History
Default Job < 1 sec
com.google.inject.CreationException: Unable to create injector, see the following errors:

1) No implementation for io.cdap.cdap.common.namespace.NamespaceAdmin was bound.
  while locating io.cdap.cdap.common.namespace.NamespaceAdmin
    for parameter 1 at io.cdap.cdap.gateway.handlers.NamespaceHttpHandler.<init>(NamespaceHttpHandler.java:57)
  at io.cdap.cdap.app.guice.AppFabricServiceRuntimeModule$AppFabricServiceModule.configure(AppFabricServiceRuntimeModule.java:342) (via modules: com.google.inject.util.Modules$CombinedModule -> io.cdap.cdap.app.guice.AppFabricServiceRuntimeModule$AppFabricServiceModule)

2) No implementation for io.cdap.cdap.common.namespace.NamespaceAdmin was bound.
(635 more lines...)
Collapse Failed RowDenormalizerAggregatorTest io.cdap.plugin.batch.aggregator.RowDenormalizerAggregatorTest History
Default Job < 1 sec
com.google.inject.CreationException: Unable to create injector, see the following errors:

1) No implementation for io.cdap.cdap.common.namespace.NamespaceAdmin was bound.
  while locating io.cdap.cdap.common.namespace.NamespaceAdmin
    for parameter 1 at io.cdap.cdap.gateway.handlers.NamespaceHttpHandler.<init>(NamespaceHttpHandler.java:57)
  at io.cdap.cdap.app.guice.AppFabricServiceRuntimeModule$AppFabricServiceModule.configure(AppFabricServiceRuntimeModule.java:342) (via modules: com.google.inject.util.Modules$CombinedModule -> io.cdap.cdap.app.guice.AppFabricServiceRuntimeModule$AppFabricServiceModule)

2) No implementation for io.cdap.cdap.common.namespace.NamespaceAdmin was bound.
(635 more lines...)
Collapse Failed BatchCubeSinkTest io.cdap.plugin.batch.sink.BatchCubeSinkTest History
Default Job < 1 sec
com.google.inject.CreationException: Unable to create injector, see the following errors:

1) No implementation for io.cdap.cdap.common.namespace.NamespaceAdmin was bound.
  while locating io.cdap.cdap.common.namespace.NamespaceAdmin
    for parameter 1 at io.cdap.cdap.gateway.handlers.NamespaceHttpHandler.<init>(NamespaceHttpHandler.java:57)
  at io.cdap.cdap.app.guice.AppFabricServiceRuntimeModule$AppFabricServiceModule.configure(AppFabricServiceRuntimeModule.java:342) (via modules: com.google.inject.util.Modules$CombinedModule -> io.cdap.cdap.app.guice.AppFabricServiceRuntimeModule$AppFabricServiceModule)

2) No implementation for io.cdap.cdap.common.namespace.NamespaceAdmin was bound.
(635 more lines...)
Collapse Failed TableSinkTest io.cdap.plugin.batch.sink.TableSinkTest History
Default Job < 1 sec
com.google.inject.CreationException: Unable to create injector, see the following errors:

1) No implementation for io.cdap.cdap.common.namespace.NamespaceAdmin was bound.
  while locating io.cdap.cdap.common.namespace.NamespaceAdmin
    for parameter 1 at io.cdap.cdap.gateway.handlers.NamespaceHttpHandler.<init>(NamespaceHttpHandler.java:57)
  at io.cdap.cdap.app.guice.AppFabricServiceRuntimeModule$AppFabricServiceModule.configure(AppFabricServiceRuntimeModule.java:342) (via modules: com.google.inject.util.Modules$CombinedModule -> io.cdap.cdap.app.guice.AppFabricServiceRuntimeModule$AppFabricServiceModule)

2) No implementation for io.cdap.cdap.common.namespace.NamespaceAdmin was bound.
(635 more lines...)
Collapse Failed FileBatchSourceTest io.cdap.plugin.batch.source.FileBatchSourceTest History
Default Job < 1 sec
com.google.inject.CreationException: Unable to create injector, see the following errors:

1) No implementation for io.cdap.cdap.common.namespace.NamespaceAdmin was bound.
  while locating io.cdap.cdap.common.namespace.NamespaceAdmin
    for parameter 1 at io.cdap.cdap.gateway.handlers.NamespaceHttpHandler.<init>(NamespaceHttpHandler.java:57)
  at io.cdap.cdap.app.guice.AppFabricServiceRuntimeModule$AppFabricServiceModule.configure(AppFabricServiceRuntimeModule.java:342) (via modules: com.google.inject.util.Modules$CombinedModule -> io.cdap.cdap.app.guice.AppFabricServiceRuntimeModule$AppFabricServiceModule)

2) No implementation for io.cdap.cdap.common.namespace.NamespaceAdmin was bound.
(640 more lines...)
Collapse Failed SnapshotFileSetTest io.cdap.plugin.common.SnapshotFileSetTest History
Default Job < 1 sec
com.google.inject.CreationException: Unable to create injector, see the following errors:

1) No implementation for io.cdap.cdap.common.namespace.NamespaceAdmin was bound.
  while locating io.cdap.cdap.common.namespace.NamespaceAdmin
    for parameter 1 at io.cdap.cdap.gateway.handlers.NamespaceHttpHandler.<init>(NamespaceHttpHandler.java:57)
  at io.cdap.cdap.app.guice.AppFabricServiceRuntimeModule$AppFabricServiceModule.configure(AppFabricServiceRuntimeModule.java:342) (via modules: com.google.inject.util.Modules$CombinedModule -> io.cdap.cdap.app.guice.AppFabricServiceRuntimeModule$AppFabricServiceModule)

2) No implementation for io.cdap.cdap.common.namespace.NamespaceAdmin was bound.
(630 more lines...)