Build #389

Build: #389 failed Changes by albertshau <ashau@google.com>

Test results

  • 275 tests in total
  • 7 tests failed
  • 7 failures are new
  • 2 tests were quarantined / skipped
  • 29 seconds taken in total.
New test failures 7
Status Test View job Duration
Collapse Failed AlertPublisherTest io.cdap.plugin.batch.AlertPublisherTest History
Default Job < 1 sec
com.google.inject.CreationException: Unable to create injector, see the following errors:

1) No implementation for io.cdap.cdap.common.namespace.NamespaceAdmin was bound.
  while locating io.cdap.cdap.common.namespace.NamespaceAdmin
    for parameter 1 at io.cdap.cdap.gateway.handlers.NamespaceHttpHandler.<init>(NamespaceHttpHandler.java:57)
  at io.cdap.cdap.app.guice.AppFabricServiceRuntimeModule$AppFabricServiceModule.configure(AppFabricServiceRuntimeModule.java:342) (via modules: com.google.inject.util.Modules$CombinedModule -> io.cdap.cdap.app.guice.AppFabricServiceRuntimeModule$AppFabricServiceModule)

2) No implementation for io.cdap.cdap.common.namespace.NamespaceAdmin was bound.
(620 more lines...)
Collapse Failed BatchPluginsTestSuite io.cdap.plugin.batch.BatchPluginsTestSuite History
Default Job < 1 sec
com.google.inject.CreationException: Unable to create injector, see the following errors:

1) No implementation for io.cdap.cdap.common.namespace.NamespaceAdmin was bound.
  while locating io.cdap.cdap.common.namespace.NamespaceAdmin
    for parameter 1 at io.cdap.cdap.gateway.handlers.NamespaceHttpHandler.<init>(NamespaceHttpHandler.java:57)
  at io.cdap.cdap.app.guice.AppFabricServiceRuntimeModule$AppFabricServiceModule.configure(AppFabricServiceRuntimeModule.java:342) (via modules: com.google.inject.util.Modules$CombinedModule -> io.cdap.cdap.app.guice.AppFabricServiceRuntimeModule$AppFabricServiceModule)

2) No implementation for io.cdap.cdap.common.namespace.NamespaceAdmin was bound.
(620 more lines...)
Collapse Failed RowDenormalizerAggregatorTest io.cdap.plugin.batch.aggregator.RowDenormalizerAggregatorTest History
Default Job < 1 sec
com.google.inject.CreationException: Unable to create injector, see the following errors:

1) No implementation for io.cdap.cdap.common.namespace.NamespaceAdmin was bound.
  while locating io.cdap.cdap.common.namespace.NamespaceAdmin
    for parameter 1 at io.cdap.cdap.gateway.handlers.NamespaceHttpHandler.<init>(NamespaceHttpHandler.java:57)
  at io.cdap.cdap.app.guice.AppFabricServiceRuntimeModule$AppFabricServiceModule.configure(AppFabricServiceRuntimeModule.java:342) (via modules: com.google.inject.util.Modules$CombinedModule -> io.cdap.cdap.app.guice.AppFabricServiceRuntimeModule$AppFabricServiceModule)

2) No implementation for io.cdap.cdap.common.namespace.NamespaceAdmin was bound.
(620 more lines...)
Collapse Failed BatchCubeSinkTest io.cdap.plugin.batch.sink.BatchCubeSinkTest History
Default Job < 1 sec
com.google.inject.CreationException: Unable to create injector, see the following errors:

1) No implementation for io.cdap.cdap.common.namespace.NamespaceAdmin was bound.
  while locating io.cdap.cdap.common.namespace.NamespaceAdmin
    for parameter 1 at io.cdap.cdap.gateway.handlers.NamespaceHttpHandler.<init>(NamespaceHttpHandler.java:57)
  at io.cdap.cdap.app.guice.AppFabricServiceRuntimeModule$AppFabricServiceModule.configure(AppFabricServiceRuntimeModule.java:342) (via modules: com.google.inject.util.Modules$CombinedModule -> io.cdap.cdap.app.guice.AppFabricServiceRuntimeModule$AppFabricServiceModule)

2) No implementation for io.cdap.cdap.common.namespace.NamespaceAdmin was bound.
(620 more lines...)
Collapse Failed TableSinkTest io.cdap.plugin.batch.sink.TableSinkTest History
Default Job < 1 sec
com.google.inject.CreationException: Unable to create injector, see the following errors:

1) No implementation for io.cdap.cdap.common.namespace.NamespaceAdmin was bound.
  while locating io.cdap.cdap.common.namespace.NamespaceAdmin
    for parameter 1 at io.cdap.cdap.gateway.handlers.NamespaceHttpHandler.<init>(NamespaceHttpHandler.java:57)
  at io.cdap.cdap.app.guice.AppFabricServiceRuntimeModule$AppFabricServiceModule.configure(AppFabricServiceRuntimeModule.java:342) (via modules: com.google.inject.util.Modules$CombinedModule -> io.cdap.cdap.app.guice.AppFabricServiceRuntimeModule$AppFabricServiceModule)

2) No implementation for io.cdap.cdap.common.namespace.NamespaceAdmin was bound.
(620 more lines...)
Collapse Failed FileBatchSourceTest io.cdap.plugin.batch.source.FileBatchSourceTest History
Default Job < 1 sec
com.google.inject.CreationException: Unable to create injector, see the following errors:

1) No implementation for io.cdap.cdap.common.namespace.NamespaceAdmin was bound.
  while locating io.cdap.cdap.common.namespace.NamespaceAdmin
    for parameter 1 at io.cdap.cdap.gateway.handlers.NamespaceHttpHandler.<init>(NamespaceHttpHandler.java:57)
  at io.cdap.cdap.app.guice.AppFabricServiceRuntimeModule$AppFabricServiceModule.configure(AppFabricServiceRuntimeModule.java:342) (via modules: com.google.inject.util.Modules$CombinedModule -> io.cdap.cdap.app.guice.AppFabricServiceRuntimeModule$AppFabricServiceModule)

2) No implementation for io.cdap.cdap.common.namespace.NamespaceAdmin was bound.
(625 more lines...)
Collapse Failed SnapshotFileSetTest io.cdap.plugin.common.SnapshotFileSetTest History
Default Job < 1 sec
com.google.inject.CreationException: Unable to create injector, see the following errors:

1) No implementation for io.cdap.cdap.common.namespace.NamespaceAdmin was bound.
  while locating io.cdap.cdap.common.namespace.NamespaceAdmin
    for parameter 1 at io.cdap.cdap.gateway.handlers.NamespaceHttpHandler.<init>(NamespaceHttpHandler.java:57)
  at io.cdap.cdap.app.guice.AppFabricServiceRuntimeModule$AppFabricServiceModule.configure(AppFabricServiceRuntimeModule.java:342) (via modules: com.google.inject.util.Modules$CombinedModule -> io.cdap.cdap.app.guice.AppFabricServiceRuntimeModule$AppFabricServiceModule)

2) No implementation for io.cdap.cdap.common.namespace.NamespaceAdmin was bound.
(615 more lines...)
Skipped tests 2
Status Test Failing since View job
Skipped ExcelInputReaderTest io.cdap.plugin.batch.source.ExcelInputReaderTest History
Default Job
Skipped XMLReaderBatchSourceTest io.cdap.plugin.batch.source.XMLReaderBatchSourceTest History
Default Job