Build #389

Build: #389 failed Changes by albertshau <ashau@google.com>

Build result summary

Details

Completed
Duration
4 minutes
Labels
None
Agent
bamboo-agent19
Revision
d97a215f6e76615381c0d1b0330f9aac7450cba9 d97a215f6e76615381c0d1b0330f9aac7450cba9
Total tests
275
Failing since
#373 (Changes by Vitalii Tymchyshyn)
Fixed in
#393 (Changes by greeshmaswaminathan <greeshmaswaminathan@users.noreply.github.com> and Greeshma Swaminathan)

Responsible

Code commits

Author Commit Message Commit date
albertshau <ashau@google.com> albertshau <ashau@google.com> d97a215f6e76615381c0d1b0330f9aac7450cba9 d97a215f6e76615381c0d1b0330f9aac7450cba9 Merge pull request #1413 from cdapio/bugfix/CDAP-18048-fix-filesource-test
CDAP-18048 use unique name for output fileset in test
albertshau <ashau@google.com> albertshau <ashau@google.com> b7ef95761adffc3f5450d47f7942050f4aeb8626 b7ef95761adffc3f5450d47f7942050f4aeb8626 CDAP-18048 use unique name for output fileset in test
Fixed a test bug where multiple tests were writing to the same
dataset, causing unexpected data in the output.

Tests

New test failures 7
Status Test View job Duration
Collapse Failed AlertPublisherTest io.cdap.plugin.batch.AlertPublisherTest History
Default Job < 1 sec
com.google.inject.CreationException: Unable to create injector, see the following errors:

1) No implementation for io.cdap.cdap.common.namespace.NamespaceAdmin was bound.
  while locating io.cdap.cdap.common.namespace.NamespaceAdmin
    for parameter 1 at io.cdap.cdap.gateway.handlers.NamespaceHttpHandler.<init>(NamespaceHttpHandler.java:57)
  at io.cdap.cdap.app.guice.AppFabricServiceRuntimeModule$AppFabricServiceModule.configure(AppFabricServiceRuntimeModule.java:342) (via modules: com.google.inject.util.Modules$CombinedModule -> io.cdap.cdap.app.guice.AppFabricServiceRuntimeModule$AppFabricServiceModule)

2) No implementation for io.cdap.cdap.common.namespace.NamespaceAdmin was bound.
(620 more lines...)
Collapse Failed BatchPluginsTestSuite io.cdap.plugin.batch.BatchPluginsTestSuite History
Default Job < 1 sec
com.google.inject.CreationException: Unable to create injector, see the following errors:

1) No implementation for io.cdap.cdap.common.namespace.NamespaceAdmin was bound.
  while locating io.cdap.cdap.common.namespace.NamespaceAdmin
    for parameter 1 at io.cdap.cdap.gateway.handlers.NamespaceHttpHandler.<init>(NamespaceHttpHandler.java:57)
  at io.cdap.cdap.app.guice.AppFabricServiceRuntimeModule$AppFabricServiceModule.configure(AppFabricServiceRuntimeModule.java:342) (via modules: com.google.inject.util.Modules$CombinedModule -> io.cdap.cdap.app.guice.AppFabricServiceRuntimeModule$AppFabricServiceModule)

2) No implementation for io.cdap.cdap.common.namespace.NamespaceAdmin was bound.
(620 more lines...)
Collapse Failed RowDenormalizerAggregatorTest io.cdap.plugin.batch.aggregator.RowDenormalizerAggregatorTest History
Default Job < 1 sec
com.google.inject.CreationException: Unable to create injector, see the following errors:

1) No implementation for io.cdap.cdap.common.namespace.NamespaceAdmin was bound.
  while locating io.cdap.cdap.common.namespace.NamespaceAdmin
    for parameter 1 at io.cdap.cdap.gateway.handlers.NamespaceHttpHandler.<init>(NamespaceHttpHandler.java:57)
  at io.cdap.cdap.app.guice.AppFabricServiceRuntimeModule$AppFabricServiceModule.configure(AppFabricServiceRuntimeModule.java:342) (via modules: com.google.inject.util.Modules$CombinedModule -> io.cdap.cdap.app.guice.AppFabricServiceRuntimeModule$AppFabricServiceModule)

2) No implementation for io.cdap.cdap.common.namespace.NamespaceAdmin was bound.
(620 more lines...)
Collapse Failed BatchCubeSinkTest io.cdap.plugin.batch.sink.BatchCubeSinkTest History
Default Job < 1 sec
com.google.inject.CreationException: Unable to create injector, see the following errors:

1) No implementation for io.cdap.cdap.common.namespace.NamespaceAdmin was bound.
  while locating io.cdap.cdap.common.namespace.NamespaceAdmin
    for parameter 1 at io.cdap.cdap.gateway.handlers.NamespaceHttpHandler.<init>(NamespaceHttpHandler.java:57)
  at io.cdap.cdap.app.guice.AppFabricServiceRuntimeModule$AppFabricServiceModule.configure(AppFabricServiceRuntimeModule.java:342) (via modules: com.google.inject.util.Modules$CombinedModule -> io.cdap.cdap.app.guice.AppFabricServiceRuntimeModule$AppFabricServiceModule)

2) No implementation for io.cdap.cdap.common.namespace.NamespaceAdmin was bound.
(620 more lines...)
Collapse Failed TableSinkTest io.cdap.plugin.batch.sink.TableSinkTest History
Default Job < 1 sec
com.google.inject.CreationException: Unable to create injector, see the following errors:

1) No implementation for io.cdap.cdap.common.namespace.NamespaceAdmin was bound.
  while locating io.cdap.cdap.common.namespace.NamespaceAdmin
    for parameter 1 at io.cdap.cdap.gateway.handlers.NamespaceHttpHandler.<init>(NamespaceHttpHandler.java:57)
  at io.cdap.cdap.app.guice.AppFabricServiceRuntimeModule$AppFabricServiceModule.configure(AppFabricServiceRuntimeModule.java:342) (via modules: com.google.inject.util.Modules$CombinedModule -> io.cdap.cdap.app.guice.AppFabricServiceRuntimeModule$AppFabricServiceModule)

2) No implementation for io.cdap.cdap.common.namespace.NamespaceAdmin was bound.
(620 more lines...)
Collapse Failed FileBatchSourceTest io.cdap.plugin.batch.source.FileBatchSourceTest History
Default Job < 1 sec
com.google.inject.CreationException: Unable to create injector, see the following errors:

1) No implementation for io.cdap.cdap.common.namespace.NamespaceAdmin was bound.
  while locating io.cdap.cdap.common.namespace.NamespaceAdmin
    for parameter 1 at io.cdap.cdap.gateway.handlers.NamespaceHttpHandler.<init>(NamespaceHttpHandler.java:57)
  at io.cdap.cdap.app.guice.AppFabricServiceRuntimeModule$AppFabricServiceModule.configure(AppFabricServiceRuntimeModule.java:342) (via modules: com.google.inject.util.Modules$CombinedModule -> io.cdap.cdap.app.guice.AppFabricServiceRuntimeModule$AppFabricServiceModule)

2) No implementation for io.cdap.cdap.common.namespace.NamespaceAdmin was bound.
(625 more lines...)
Collapse Failed SnapshotFileSetTest io.cdap.plugin.common.SnapshotFileSetTest History
Default Job < 1 sec
com.google.inject.CreationException: Unable to create injector, see the following errors:

1) No implementation for io.cdap.cdap.common.namespace.NamespaceAdmin was bound.
  while locating io.cdap.cdap.common.namespace.NamespaceAdmin
    for parameter 1 at io.cdap.cdap.gateway.handlers.NamespaceHttpHandler.<init>(NamespaceHttpHandler.java:57)
  at io.cdap.cdap.app.guice.AppFabricServiceRuntimeModule$AppFabricServiceModule.configure(AppFabricServiceRuntimeModule.java:342) (via modules: com.google.inject.util.Modules$CombinedModule -> io.cdap.cdap.app.guice.AppFabricServiceRuntimeModule$AppFabricServiceModule)

2) No implementation for io.cdap.cdap.common.namespace.NamespaceAdmin was bound.
(615 more lines...)

JIRA issues

IssueDescriptionStatus
Unknown Issue TypeCDAP-18048Could not obtain issue details from JIRA