Build #373

Build: #373 failed Changes by Vitalii Tymchyshyn

Build result summary

Details

Completed
Duration
22 minutes
Labels
None
Agent
bamboo-agent09
Revision
40937a5b0b2718b85af0f39421488c3228f072f8 40937a5b0b2718b85af0f39421488c3228f072f8
Total tests
288
Fixed in
#393 (Changes by greeshmaswaminathan <greeshmaswaminathan@users.noreply.github.com> and Greeshma Swaminathan)

Responsible

Code commits

Author Commit Message Commit date
Vitalii Tymchyshyn Vitalii Tymchyshyn 40937a5b0b2718b85af0f39421488c3228f072f8 40937a5b0b2718b85af0f39421488c3228f072f8 Merge pull request #1364 from cdapio/feature/CDAP-17693-spark3
[CDAP-17693] Introduce spark 3 for tests, drop spark 1, create spark …
Vitalii Tymchyshyn Vitalii Tymchyshyn 4aa7ddcfa9f363ee4e2d30a8b586aa1f9eac5c7f 4aa7ddcfa9f363ee4e2d30a8b586aa1f9eac5c7f [CDAP-17693] Introduce spark 3 for tests, drop spark 1, create spark 3 runtime for cdap sandbox and standalone

Tests

New test failures 3
Status Test View job Duration
Collapse Failed DedupTestRun testDedup History
Default Job 8 secs
java.lang.AssertionError: Expected records expected:<2> but was:<0>
	at org.junit.Assert.fail(Assert.java:88)
	at org.junit.Assert.failNotEquals(Assert.java:743)
	at org.junit.Assert.assertEquals(Assert.java:118)
	at org.junit.Assert.assertEquals(Assert.java:555)
	at io.cdap.plugin.batch.aggregator.DedupTestRun.testHelper(DedupTestRun.java:111)
	at io.cdap.plugin.batch.aggregator.DedupTestRun.testDedup(DedupTestRun.java:130)
Collapse Failed DedupTestRun testDedupWithMacro History
Default Job 8 secs
java.lang.AssertionError: Expected records expected:<2> but was:<0>
	at org.junit.Assert.fail(Assert.java:88)
	at org.junit.Assert.failNotEquals(Assert.java:743)
	at org.junit.Assert.assertEquals(Assert.java:118)
	at org.junit.Assert.assertEquals(Assert.java:555)
	at io.cdap.plugin.batch.aggregator.DedupTestRun.testHelper(DedupTestRun.java:111)
	at io.cdap.plugin.batch.aggregator.DedupTestRun.testDedupWithMacro(DedupTestRun.java:138)
Collapse Failed GroupByTestRun testGroupBy History
Default Job 14 secs
java.lang.NullPointerException: null
	at java.util.Objects.requireNonNull(Objects.java:203)
	at io.cdap.plugin.batch.aggregator.GroupByTestRun.testGroupBy(GroupByTestRun.java:235)
	at io.cdap.plugin.batch.aggregator.GroupByTestRun.testGroupBy(GroupByTestRun.java:64)

JIRA issues

IssueDescriptionStatus
Unknown Issue TypeCDAP-17693Could not obtain issue details from JIRA