Build #227

Build: #227 failed Changes by albertshau <ashau@google.com>

Test results

  • 218 tests in total
  • 7 tests failed
  • 7 failures are new
  • 2 tests were quarantined / skipped
  • 8 minutes taken in total.
New test failures 7
Status Test View job Duration
Collapse Failed DBSinkTestRun testNullFields History
Default Job 1 sec
java.lang.IllegalStateException: Expected 200 OK, got 400 Bad Request. Error: Failed to deploy app
	at co.cask.cdap.internal.AppFabricClient.verifyResponse(AppFabricClient.java:425)
	at co.cask.cdap.internal.AppFabricClient.deployApplication(AppFabricClient.java:491)
	at co.cask.cdap.test.UnitTestManager.deployApplication(UnitTestManager.java:192)
	at co.cask.cdap.test.TestBase.deployApplication(TestBase.java:582)
	at co.cask.hydrator.plugin.DatabasePluginTestBase.deployETL(DatabasePluginTestBase.java:280)
	at co.cask.hydrator.plugin.db.batch.sink.DBSinkTestRun.testNullFields(DBSinkTestRun.java:129)
Collapse Failed DBSourceTestRun testDBSource History
Default Job < 1 sec
java.lang.IllegalStateException: Expected 200 OK, got 400 Bad Request. Error: Failed to deploy app
	at co.cask.cdap.internal.AppFabricClient.verifyResponse(AppFabricClient.java:425)
	at co.cask.cdap.internal.AppFabricClient.deployApplication(AppFabricClient.java:491)
	at co.cask.cdap.test.UnitTestManager.deployApplication(UnitTestManager.java:192)
	at co.cask.cdap.test.TestBase.deployApplication(TestBase.java:582)
	at co.cask.hydrator.plugin.DatabasePluginTestBase.deployETL(DatabasePluginTestBase.java:280)
	at co.cask.hydrator.plugin.db.batch.sink.DBSourceTestRun.testDBSource(DBSourceTestRun.java:115)
Collapse Failed DBSourceTestRun testDBMacroSupport History
Default Job < 1 sec
java.lang.IllegalStateException: Expected 200 OK, got 400 Bad Request. Error: Failed to deploy app
	at co.cask.cdap.internal.AppFabricClient.verifyResponse(AppFabricClient.java:425)
	at co.cask.cdap.internal.AppFabricClient.deployApplication(AppFabricClient.java:491)
	at co.cask.cdap.test.UnitTestManager.deployApplication(UnitTestManager.java:192)
	at co.cask.cdap.test.TestBase.deployApplication(TestBase.java:582)
	at co.cask.hydrator.plugin.DatabasePluginTestBase.deployETL(DatabasePluginTestBase.java:280)
	at co.cask.hydrator.plugin.db.batch.sink.DBSourceTestRun.testDBMacroSupport(DBSourceTestRun.java:82)
Collapse Failed DBSourceTestRun testNonExistentDBTable History
Default Job < 1 sec
java.lang.IllegalStateException: Expected 200 OK, got 400 Bad Request. Error: Failed to deploy app
	at co.cask.cdap.internal.AppFabricClient.verifyResponse(AppFabricClient.java:425)
	at co.cask.cdap.internal.AppFabricClient.deployApplication(AppFabricClient.java:491)
	at co.cask.cdap.test.UnitTestManager.deployApplication(UnitTestManager.java:192)
	at co.cask.cdap.test.TestBase.deployApplication(TestBase.java:582)
	at co.cask.hydrator.plugin.DatabasePluginTestBase.assertRuntimeFailure(DatabasePluginTestBase.java:262)
	at co.cask.hydrator.plugin.db.batch.sink.DBSourceTestRun.testNonExistentDBTable(DBSourceTestRun.java:353)
Collapse Failed DBSourceTestRun testDbSourceMultipleTables History
Default Job < 1 sec
java.lang.IllegalStateException: Expected 200 OK, got 400 Bad Request. Error: Failed to deploy app
	at co.cask.cdap.internal.AppFabricClient.verifyResponse(AppFabricClient.java:425)
	at co.cask.cdap.internal.AppFabricClient.deployApplication(AppFabricClient.java:491)
	at co.cask.cdap.test.UnitTestManager.deployApplication(UnitTestManager.java:192)
	at co.cask.cdap.test.TestBase.deployApplication(TestBase.java:582)
	at co.cask.hydrator.plugin.DatabasePluginTestBase.deployETL(DatabasePluginTestBase.java:280)
	at co.cask.hydrator.plugin.db.batch.sink.DBSourceTestRun.testDbSourceMultipleTables(DBSourceTestRun.java:247)
Collapse Failed DBSourceTestRun testUserNamePasswordCombinations History
Default Job < 1 sec
java.lang.IllegalStateException: Expected 200 OK, got 400 Bad Request. Error: Failed to deploy app
	at co.cask.cdap.internal.AppFabricClient.verifyResponse(AppFabricClient.java:425)
	at co.cask.cdap.internal.AppFabricClient.deployApplication(AppFabricClient.java:491)
	at co.cask.cdap.test.UnitTestManager.deployApplication(UnitTestManager.java:192)
	at co.cask.cdap.test.TestBase.deployApplication(TestBase.java:582)
	at co.cask.hydrator.plugin.db.batch.sink.DBSourceTestRun.testUserNamePasswordCombinations(DBSourceTestRun.java:294)
Collapse Failed DBSourceTestRun testDBSourceWithLowerCaseColNames History
Default Job < 1 sec
java.lang.IllegalStateException: Expected 200 OK, got 400 Bad Request. Error: Failed to deploy app
	at co.cask.cdap.internal.AppFabricClient.verifyResponse(AppFabricClient.java:425)
	at co.cask.cdap.internal.AppFabricClient.deployApplication(AppFabricClient.java:491)
	at co.cask.cdap.test.UnitTestManager.deployApplication(UnitTestManager.java:192)
	at co.cask.cdap.test.TestBase.deployApplication(TestBase.java:582)
	at co.cask.hydrator.plugin.DatabasePluginTestBase.deployETL(DatabasePluginTestBase.java:280)
	at co.cask.hydrator.plugin.db.batch.sink.DBSourceTestRun.testDBSourceWithLowerCaseColNames(DBSourceTestRun.java:204)
Skipped tests 2
Status Test Failing since View job
Skipped ExcelInputReaderTest co.cask.hydrator.plugin.batch.source.ExcelInputReaderTest History
Default Job
Skipped XMLReaderBatchSourceTest co.cask.hydrator.plugin.batch.source.XMLReaderBatchSourceTest History
Default Job