Build #227

Build: #227 failed Changes by albertshau <ashau@google.com>

Build result summary

Details

Completed
Duration
23 minutes
Labels
None
Agent
bamboo-agent12
Revision
4a8f59b84346b71be87a0357b7343571e5869043 4a8f59b84346b71be87a0357b7343571e5869043
Total tests
218
Fixed in
#229 (Changes by Edwin Elia <edwinelia@google.com>)

Responsible

No one has taken responsibility for this failure

Code commits

Author Commit Message Commit date
albertshau <ashau@google.com> albertshau <ashau@google.com> 4a8f59b84346b71be87a0357b7343571e5869043 4a8f59b84346b71be87a0357b7343571e5869043 Merge pull request #893 from cdapio/feature/CDAP-14772-remove-plugin-endpoint
CDAP-14772 remove plugin endpoint from db source
albertshau <ashau@google.com> albertshau <ashau@google.com> 3f428150c603ed3e1b554c1cd5b6964609c0625d 3f428150c603ed3e1b554c1cd5b6964609c0625d CDAP-14772 remove plugin endpoint from db source
Instead, the source will lookup the schema if the schema is null,
and has the UI configured to always send a null schema when using
the get schema button.

Tests

New test failures 7
Status Test View job Duration
Collapse Failed DBSinkTestRun testNullFields History
Default Job 1 sec
java.lang.IllegalStateException: Expected 200 OK, got 400 Bad Request. Error: Failed to deploy app
	at co.cask.cdap.internal.AppFabricClient.verifyResponse(AppFabricClient.java:425)
	at co.cask.cdap.internal.AppFabricClient.deployApplication(AppFabricClient.java:491)
	at co.cask.cdap.test.UnitTestManager.deployApplication(UnitTestManager.java:192)
	at co.cask.cdap.test.TestBase.deployApplication(TestBase.java:582)
	at co.cask.hydrator.plugin.DatabasePluginTestBase.deployETL(DatabasePluginTestBase.java:280)
	at co.cask.hydrator.plugin.db.batch.sink.DBSinkTestRun.testNullFields(DBSinkTestRun.java:129)
Collapse Failed DBSourceTestRun testDBMacroSupport History
Default Job < 1 sec
java.lang.IllegalStateException: Expected 200 OK, got 400 Bad Request. Error: Failed to deploy app
	at co.cask.cdap.internal.AppFabricClient.verifyResponse(AppFabricClient.java:425)
	at co.cask.cdap.internal.AppFabricClient.deployApplication(AppFabricClient.java:491)
	at co.cask.cdap.test.UnitTestManager.deployApplication(UnitTestManager.java:192)
	at co.cask.cdap.test.TestBase.deployApplication(TestBase.java:582)
	at co.cask.hydrator.plugin.DatabasePluginTestBase.deployETL(DatabasePluginTestBase.java:280)
	at co.cask.hydrator.plugin.db.batch.sink.DBSourceTestRun.testDBMacroSupport(DBSourceTestRun.java:82)
Collapse Failed DBSourceTestRun testNonExistentDBTable History
Default Job < 1 sec
java.lang.IllegalStateException: Expected 200 OK, got 400 Bad Request. Error: Failed to deploy app
	at co.cask.cdap.internal.AppFabricClient.verifyResponse(AppFabricClient.java:425)
	at co.cask.cdap.internal.AppFabricClient.deployApplication(AppFabricClient.java:491)
	at co.cask.cdap.test.UnitTestManager.deployApplication(UnitTestManager.java:192)
	at co.cask.cdap.test.TestBase.deployApplication(TestBase.java:582)
	at co.cask.hydrator.plugin.DatabasePluginTestBase.assertRuntimeFailure(DatabasePluginTestBase.java:262)
	at co.cask.hydrator.plugin.db.batch.sink.DBSourceTestRun.testNonExistentDBTable(DBSourceTestRun.java:353)
Collapse Failed DBSourceTestRun testDbSourceMultipleTables History
Default Job < 1 sec
java.lang.IllegalStateException: Expected 200 OK, got 400 Bad Request. Error: Failed to deploy app
	at co.cask.cdap.internal.AppFabricClient.verifyResponse(AppFabricClient.java:425)
	at co.cask.cdap.internal.AppFabricClient.deployApplication(AppFabricClient.java:491)
	at co.cask.cdap.test.UnitTestManager.deployApplication(UnitTestManager.java:192)
	at co.cask.cdap.test.TestBase.deployApplication(TestBase.java:582)
	at co.cask.hydrator.plugin.DatabasePluginTestBase.deployETL(DatabasePluginTestBase.java:280)
	at co.cask.hydrator.plugin.db.batch.sink.DBSourceTestRun.testDbSourceMultipleTables(DBSourceTestRun.java:247)
Collapse Failed DBSourceTestRun testUserNamePasswordCombinations History
Default Job < 1 sec
java.lang.IllegalStateException: Expected 200 OK, got 400 Bad Request. Error: Failed to deploy app
	at co.cask.cdap.internal.AppFabricClient.verifyResponse(AppFabricClient.java:425)
	at co.cask.cdap.internal.AppFabricClient.deployApplication(AppFabricClient.java:491)
	at co.cask.cdap.test.UnitTestManager.deployApplication(UnitTestManager.java:192)
	at co.cask.cdap.test.TestBase.deployApplication(TestBase.java:582)
	at co.cask.hydrator.plugin.db.batch.sink.DBSourceTestRun.testUserNamePasswordCombinations(DBSourceTestRun.java:294)
Collapse Failed DBSourceTestRun testDBSourceWithLowerCaseColNames History
Default Job < 1 sec
java.lang.IllegalStateException: Expected 200 OK, got 400 Bad Request. Error: Failed to deploy app
	at co.cask.cdap.internal.AppFabricClient.verifyResponse(AppFabricClient.java:425)
	at co.cask.cdap.internal.AppFabricClient.deployApplication(AppFabricClient.java:491)
	at co.cask.cdap.test.UnitTestManager.deployApplication(UnitTestManager.java:192)
	at co.cask.cdap.test.TestBase.deployApplication(TestBase.java:582)
	at co.cask.hydrator.plugin.DatabasePluginTestBase.deployETL(DatabasePluginTestBase.java:280)
	at co.cask.hydrator.plugin.db.batch.sink.DBSourceTestRun.testDBSourceWithLowerCaseColNames(DBSourceTestRun.java:204)
Collapse Failed DBSourceTestRun testDBSource History
Default Job < 1 sec
java.lang.IllegalStateException: Expected 200 OK, got 400 Bad Request. Error: Failed to deploy app
	at co.cask.cdap.internal.AppFabricClient.verifyResponse(AppFabricClient.java:425)
	at co.cask.cdap.internal.AppFabricClient.deployApplication(AppFabricClient.java:491)
	at co.cask.cdap.test.UnitTestManager.deployApplication(UnitTestManager.java:192)
	at co.cask.cdap.test.TestBase.deployApplication(TestBase.java:582)
	at co.cask.hydrator.plugin.DatabasePluginTestBase.deployETL(DatabasePluginTestBase.java:280)
	at co.cask.hydrator.plugin.db.batch.sink.DBSourceTestRun.testDBSource(DBSourceTestRun.java:115)

JIRA issues

IssueDescriptionStatus
Unknown Issue TypeCDAP-14772Could not obtain issue details from JIRA