Build #198

Build: #198 failed Changes by albertshau <ashau@google.com>

Build result summary

Details

Completed
Duration
16 minutes
Labels
None
Agent
bamboo-agent05
Revision
2789f00702bb66f46bd1bc8cdbbff132da81ce3c 2789f00702bb66f46bd1bc8cdbbff132da81ce3c
Total tests
191
Failing since
#188 (Changes by Rohit Sinha <rosinha@google.com>)

Responsible

This build has been failing since #188
No one has taken responsibility

Code commits

Author Commit Message Commit date
albertshau <ashau@google.com> albertshau <ashau@google.com> 2789f00702bb66f46bd1bc8cdbbff132da81ce3c 2789f00702bb66f46bd1bc8cdbbff132da81ce3c Merge pull request #815 from caskdata/feature/CDAP-14125-add-file-action-icons
CDAP-14125 add icons for file move and file delete actions
albertshau <ashau@google.com> albertshau <ashau@google.com> aac0d14bb6df44b6b117b709985e833b2a326d1f aac0d14bb6df44b6b117b709985e833b2a326d1f CDAP-14125 add icons for file move and file delete actions
As part of this work, removed the old javascript build step used
to create the widget spec in favor of the maven plugin.

Tests

Existing test failures 14
Status Test Failing since View job Duration
java.lang.IllegalStateException: Expected 200 OK, got 400 Bad Request. Error: Failed to deploy app
	at co.cask.cdap.internal.AppFabricClient.verifyResponse(AppFabricClient.java:453)
	at co.cask.cdap.internal.AppFabricClient.deployApplication(AppFabricClient.java:519)
	at co.cask.cdap.test.UnitTestManager.deployApplication(UnitTestManager.java:201)
	at co.cask.cdap.test.TestBase.deployApplication(TestBase.java:616)
	at co.cask.hydrator.plugin.batch.ETLBatchTestBase.deployETL(ETLBatchTestBase.java:195)
	at co.cask.hydrator.plugin.batch.AlertPublisherTest.testAlertPublisher(AlertPublisherTest.java:80)
java.lang.IllegalStateException: Expected 200 OK, got 400 Bad Request. Error: Failed to deploy app
	at co.cask.cdap.internal.AppFabricClient.verifyResponse(AppFabricClient.java:453)
	at co.cask.cdap.internal.AppFabricClient.deployApplication(AppFabricClient.java:519)
	at co.cask.cdap.test.UnitTestManager.deployApplication(UnitTestManager.java:201)
	at co.cask.cdap.test.TestBase.deployApplication(TestBase.java:616)
	at co.cask.hydrator.plugin.batch.ETLBatchTestBase.deployETL(ETLBatchTestBase.java:195)
	at co.cask.hydrator.plugin.batch.ETLTPFSTestRun.testOrc(ETLTPFSTestRun.java:210)
java.lang.IllegalStateException: Expected 200 OK, got 400 Bad Request. Error: Failed to deploy app
	at co.cask.cdap.internal.AppFabricClient.verifyResponse(AppFabricClient.java:453)
	at co.cask.cdap.internal.AppFabricClient.deployApplication(AppFabricClient.java:519)
	at co.cask.cdap.test.UnitTestManager.deployApplication(UnitTestManager.java:201)
	at co.cask.cdap.test.TestBase.deployApplication(TestBase.java:616)
	at co.cask.hydrator.plugin.batch.source.FileBatchSourceTest.testPathGlobbing(FileBatchSourceTest.java:391)
java.lang.IllegalStateException: Expected 200 OK, got 400 Bad Request. Error: Failed to deploy app
	at co.cask.cdap.internal.AppFabricClient.verifyResponse(AppFabricClient.java:453)
	at co.cask.cdap.internal.AppFabricClient.deployApplication(AppFabricClient.java:519)
	at co.cask.cdap.test.UnitTestManager.deployApplication(UnitTestManager.java:201)
	at co.cask.cdap.test.TestBase.deployApplication(TestBase.java:616)
	at co.cask.hydrator.plugin.batch.source.FileBatchSourceTest.createSourceAndDeployApp(FileBatchSourceTest.java:803)
	at co.cask.hydrator.plugin.batch.source.FileBatchSourceTest.testFileBatchInputFormatParquetNullSchema(FileBatchSourceTest.java:695)
java.lang.IllegalStateException: Expected 200 OK, got 400 Bad Request. Error: Failed to deploy app
	at co.cask.cdap.internal.AppFabricClient.verifyResponse(AppFabricClient.java:453)
	at co.cask.cdap.internal.AppFabricClient.deployApplication(AppFabricClient.java:519)
	at co.cask.cdap.test.UnitTestManager.deployApplication(UnitTestManager.java:201)
	at co.cask.cdap.test.TestBase.deployApplication(TestBase.java:616)
	at co.cask.hydrator.plugin.batch.source.FileBatchSourceTest.testRecursiveTimeFilterRegex(FileBatchSourceTest.java:470)
java.lang.IllegalStateException: Expected 200 OK, got 400 Bad Request. Error: Failed to deploy app
	at co.cask.cdap.internal.AppFabricClient.verifyResponse(AppFabricClient.java:453)
	at co.cask.cdap.internal.AppFabricClient.deployApplication(AppFabricClient.java:519)
	at co.cask.cdap.test.UnitTestManager.deployApplication(UnitTestManager.java:201)
	at co.cask.cdap.test.TestBase.deployApplication(TestBase.java:616)
	at co.cask.hydrator.plugin.batch.source.FileBatchSourceTest.testRecursiveFolders(FileBatchSourceTest.java:226)
java.lang.IllegalStateException: Expected 200 OK, got 400 Bad Request. Error: Failed to deploy app
	at co.cask.cdap.internal.AppFabricClient.verifyResponse(AppFabricClient.java:453)
	at co.cask.cdap.internal.AppFabricClient.deployApplication(AppFabricClient.java:519)
	at co.cask.cdap.test.UnitTestManager.deployApplication(UnitTestManager.java:201)
	at co.cask.cdap.test.TestBase.deployApplication(TestBase.java:616)
	at co.cask.hydrator.plugin.batch.source.FileBatchSourceTest.createSourceAndDeployApp(FileBatchSourceTest.java:803)
	at co.cask.hydrator.plugin.batch.source.FileBatchSourceTest.testFileBatchInputFormatParquet(FileBatchSourceTest.java:657)
java.lang.IllegalStateException: Expected 200 OK, got 400 Bad Request. Error: Failed to deploy app
	at co.cask.cdap.internal.AppFabricClient.verifyResponse(AppFabricClient.java:453)
	at co.cask.cdap.internal.AppFabricClient.deployApplication(AppFabricClient.java:519)
	at co.cask.cdap.test.UnitTestManager.deployApplication(UnitTestManager.java:201)
	at co.cask.cdap.test.TestBase.deployApplication(TestBase.java:616)
	at co.cask.hydrator.plugin.batch.source.FileBatchSourceTest.testIgnoreNonExistingFolder(FileBatchSourceTest.java:154)
java.lang.IllegalStateException: Expected 200 OK, got 400 Bad Request. Error: Failed to deploy app
	at co.cask.cdap.internal.AppFabricClient.verifyResponse(AppFabricClient.java:453)
	at co.cask.cdap.internal.AppFabricClient.deployApplication(AppFabricClient.java:519)
	at co.cask.cdap.test.UnitTestManager.deployApplication(UnitTestManager.java:201)
	at co.cask.cdap.test.TestBase.deployApplication(TestBase.java:616)
	at co.cask.hydrator.plugin.batch.source.FileBatchSourceTest.createSourceAndDeployApp(FileBatchSourceTest.java:803)
	at co.cask.hydrator.plugin.batch.source.FileBatchSourceTest.testFileBatchInputFormatText(FileBatchSourceTest.java:500)
java.lang.IllegalStateException: Expected 200 OK, got 400 Bad Request. Error: Failed to deploy app
	at co.cask.cdap.internal.AppFabricClient.verifyResponse(AppFabricClient.java:453)
	at co.cask.cdap.internal.AppFabricClient.deployApplication(AppFabricClient.java:519)
	at co.cask.cdap.test.UnitTestManager.deployApplication(UnitTestManager.java:201)
	at co.cask.cdap.test.TestBase.deployApplication(TestBase.java:616)
	at co.cask.hydrator.plugin.batch.source.FileBatchSourceTest.testNotPresentFolder(FileBatchSourceTest.java:188)
java.lang.IllegalStateException: Expected 200 OK, got 400 Bad Request. Error: Failed to deploy app
	at co.cask.cdap.internal.AppFabricClient.verifyResponse(AppFabricClient.java:453)
	at co.cask.cdap.internal.AppFabricClient.deployApplication(AppFabricClient.java:519)
	at co.cask.cdap.test.UnitTestManager.deployApplication(UnitTestManager.java:201)
	at co.cask.cdap.test.TestBase.deployApplication(TestBase.java:616)
	at co.cask.hydrator.plugin.batch.source.FileBatchSourceTest.testRecursiveRegex(FileBatchSourceTest.java:349)
java.lang.IllegalStateException: Expected 200 OK, got 400 Bad Request. Error: Failed to deploy app
	at co.cask.cdap.internal.AppFabricClient.verifyResponse(AppFabricClient.java:453)
	at co.cask.cdap.internal.AppFabricClient.deployApplication(AppFabricClient.java:519)
	at co.cask.cdap.test.UnitTestManager.deployApplication(UnitTestManager.java:201)
	at co.cask.cdap.test.TestBase.deployApplication(TestBase.java:616)
	at co.cask.hydrator.plugin.batch.source.FileBatchSourceTest.testNonRecursiveRegex(FileBatchSourceTest.java:267)
java.lang.IllegalStateException: Expected 200 OK, got 400 Bad Request. Error: Failed to deploy app
	at co.cask.cdap.internal.AppFabricClient.verifyResponse(AppFabricClient.java:453)
	at co.cask.cdap.internal.AppFabricClient.deployApplication(AppFabricClient.java:519)
	at co.cask.cdap.test.UnitTestManager.deployApplication(UnitTestManager.java:201)
	at co.cask.cdap.test.TestBase.deployApplication(TestBase.java:616)
	at co.cask.hydrator.plugin.batch.source.FileBatchSourceTest.testFileRegex(FileBatchSourceTest.java:308)
java.lang.IllegalStateException: Expected 200 OK, got 400 Bad Request. Error: Failed to deploy app
	at co.cask.cdap.internal.AppFabricClient.verifyResponse(AppFabricClient.java:453)
	at co.cask.cdap.internal.AppFabricClient.deployApplication(AppFabricClient.java:519)
	at co.cask.cdap.test.UnitTestManager.deployApplication(UnitTestManager.java:201)
	at co.cask.cdap.test.TestBase.deployApplication(TestBase.java:616)
	at co.cask.hydrator.plugin.batch.source.FileBatchSourceTest.testTimeFilterRegex(FileBatchSourceTest.java:433)

JIRA issues

IssueDescriptionStatus
Unknown Issue TypeCDAP-14125Could not obtain issue details from JIRA