Build #1

Build: #1 failed Changes by 9 people

Build result summary

Details

Completed
Duration
14 minutes
Labels
None
Agent
bamboo-agent17
Revision
54c8c805c92122f2a7393d3907b509df3e0830f7 54c8c805c92122f2a7393d3907b509df3e0830f7
Total tests
178
Fixed in
#2 (Changes by 13 people)

Responsible

Code commits

Author Commit Message Commit date
GitHub <noreply@github.com> GitHub <noreply@github.com> 54c8c805c92122f2a7393d3907b509df3e0830f7 54c8c805c92122f2a7393d3907b509df3e0830f7 Merge pull request #366 from caskdata/release/1.4
Merge release/1.4 to develop.
GitHub <noreply@github.com> GitHub <noreply@github.com> 49c9123d2855ecf2f755a777621cbbd9407548bf 49c9123d2855ecf2f755a777621cbbd9407548bf Merge pull request #355 from caskdata/fix-TPFSParquetSource-HYDRA-125
fix HYDRA-125 cannot read from TPFS Parquet source
Yaojie Feng <Yaojie@Casks-MacBook-Pro.local> Yaojie Feng <Yaojie@Casks-MacBook-Pro.local> fa7bcecfda9bf52c4d2db698d0c004892f97e0df fa7bcecfda9bf52c4d2db698d0c004892f97e0df HYDRA-125 Fixed RuntimeException when reading from TPFSParquetSource on HDP cluster.
GitHub <noreply@github.com> GitHub <noreply@github.com> cc3d91e741f66349d4fd419f4654e585b4a0b955 cc3d91e741f66349d4fd419f4654e585b4a0b955 Merge pull request #358 from caskdata/fix/stream-source-doc-comment
doc update for stream batch source name field
Shankar Selvam Shankar Selvam cdd092d2731dee30e772719e2bbb307dd3a91168 cdd092d2731dee30e772719e2bbb307dd3a91168 doc update for stream batch source name field

Tests

New test failures 15
Status Test View job Duration
Collapse Failed ETLMapReduceTestRun testFiletoMultipleTPFS History
Default Job < 1 sec
java.lang.IllegalStateException: Expected 200 OK, got 404 Not Found. Error: Failed to deploy app
	at co.cask.cdap.internal.AppFabricClient.verifyResponse(AppFabricClient.java:370)
	at co.cask.cdap.internal.AppFabricClient.deployApplication(AppFabricClient.java:428)
	at co.cask.cdap.test.UnitTestManager.deployApplication(UnitTestManager.java:199)
	at co.cask.cdap.test.TestBase.deployApplication(TestBase.java:522)
	at co.cask.hydrator.plugin.batch.ETLMapReduceTestRun.testFiletoMultipleTPFS(ETLMapReduceTestRun.java:462)
Collapse Failed ETLMapReduceTestRun testS3toTPFS History
Default Job < 1 sec
java.lang.IllegalStateException: Expected 200 OK, got 404 Not Found. Error: Failed to deploy app
	at co.cask.cdap.internal.AppFabricClient.verifyResponse(AppFabricClient.java:370)
	at co.cask.cdap.internal.AppFabricClient.deployApplication(AppFabricClient.java:428)
	at co.cask.cdap.test.UnitTestManager.deployApplication(UnitTestManager.java:199)
	at co.cask.cdap.test.TestBase.deployApplication(TestBase.java:522)
	at co.cask.hydrator.plugin.batch.ETLMapReduceTestRun.testS3toTPFS(ETLMapReduceTestRun.java:401)
Collapse Failed ETLMapReduceTestRun testTableToTableWithValidations History
Default Job < 1 sec
java.lang.IllegalStateException: Expected 200 OK, got 404 Not Found. Error: Failed to deploy app
	at co.cask.cdap.internal.AppFabricClient.verifyResponse(AppFabricClient.java:370)
	at co.cask.cdap.internal.AppFabricClient.deployApplication(AppFabricClient.java:428)
	at co.cask.cdap.test.UnitTestManager.deployApplication(UnitTestManager.java:199)
	at co.cask.cdap.test.TestBase.deployApplication(TestBase.java:522)
	at co.cask.hydrator.plugin.batch.ETLMapReduceTestRun.testTableToTableWithValidations(ETLMapReduceTestRun.java:300)
Collapse Failed ETLMapReduceTestRun testKVToKV History
Default Job < 1 sec
java.lang.IllegalStateException: Expected 200 OK, got 404 Not Found. Error: Failed to deploy app
	at co.cask.cdap.internal.AppFabricClient.verifyResponse(AppFabricClient.java:370)
	at co.cask.cdap.internal.AppFabricClient.deployApplication(AppFabricClient.java:428)
	at co.cask.cdap.test.UnitTestManager.deployApplication(UnitTestManager.java:199)
	at co.cask.cdap.test.TestBase.deployApplication(TestBase.java:522)
	at co.cask.hydrator.plugin.batch.ETLMapReduceTestRun.testKVToKV(ETLMapReduceTestRun.java:119)
Collapse Failed ETLMapReduceTestRun testDAG History
Default Job < 1 sec
java.lang.IllegalStateException: Expected 200 OK, got 404 Not Found. Error: Failed to deploy app
	at co.cask.cdap.internal.AppFabricClient.verifyResponse(AppFabricClient.java:370)
	at co.cask.cdap.internal.AppFabricClient.deployApplication(AppFabricClient.java:428)
	at co.cask.cdap.test.UnitTestManager.deployApplication(UnitTestManager.java:199)
	at co.cask.cdap.test.TestBase.deployApplication(TestBase.java:522)
	at co.cask.hydrator.plugin.batch.ETLMapReduceTestRun.testDAG(ETLMapReduceTestRun.java:198)
Collapse Failed ETLStreamConversionTestRun testStreamConversionTPFSAvroSink History
Default Job < 1 sec
java.lang.IllegalArgumentException: Home directory /tmp/HYP-BAD-JOB1/junit7805353154804160275/junit3875758594414347520/namespaces/default for namespace namespace:default not found
	at com.google.common.base.Preconditions.checkArgument(Preconditions.java:119)
	at co.cask.cdap.data2.transaction.stream.FileStreamAdmin.assertNamespaceHomeExists(FileStreamAdmin.java:459)
	at co.cask.cdap.data2.transaction.stream.FileStreamAdmin.access$900(FileStreamAdmin.java:93)
	at co.cask.cdap.data2.transaction.stream.FileStreamAdmin$8.call(FileStreamAdmin.java:399)
	at co.cask.cdap.data2.transaction.stream.FileStreamAdmin$8.call(FileStreamAdmin.java:396)
	at co.cask.cdap.data2.security.ImpersonationUtils$1.run(ImpersonationUtils.java:46)
	at java.security.AccessController.doPrivileged(Native Method)
(8 more lines...)
Collapse Failed ETLStreamConversionTestRun testStreamConversionTPFSParquetSink History
Default Job < 1 sec
java.lang.IllegalArgumentException: Home directory /tmp/HYP-BAD-JOB1/junit7805353154804160275/junit3875758594414347520/namespaces/default for namespace namespace:default not found
	at com.google.common.base.Preconditions.checkArgument(Preconditions.java:119)
	at co.cask.cdap.data2.transaction.stream.FileStreamAdmin.assertNamespaceHomeExists(FileStreamAdmin.java:459)
	at co.cask.cdap.data2.transaction.stream.FileStreamAdmin.access$900(FileStreamAdmin.java:93)
	at co.cask.cdap.data2.transaction.stream.FileStreamAdmin$8.call(FileStreamAdmin.java:399)
	at co.cask.cdap.data2.transaction.stream.FileStreamAdmin$8.call(FileStreamAdmin.java:396)
	at co.cask.cdap.data2.security.ImpersonationUtils$1.run(ImpersonationUtils.java:46)
	at java.security.AccessController.doPrivileged(Native Method)
(8 more lines...)
Collapse Failed ETLTPFSTestRun testAvroSourceConversionToAvroSink History
Default Job 5 secs
java.lang.IllegalStateException: Expected 200 OK, got 404 Not Found. Error: Failed to deploy app
	at co.cask.cdap.internal.AppFabricClient.verifyResponse(AppFabricClient.java:370)
	at co.cask.cdap.internal.AppFabricClient.deployApplication(AppFabricClient.java:428)
	at co.cask.cdap.test.UnitTestManager.deployApplication(UnitTestManager.java:199)
	at co.cask.cdap.test.TestBase.deployApplication(TestBase.java:522)
	at co.cask.hydrator.plugin.batch.ETLTPFSTestRun.testAvroSourceConversionToAvroSink(ETLTPFSTestRun.java:207)
Collapse Failed ETLTPFSTestRun testParquet History
Default Job < 1 sec
java.lang.IllegalStateException: Expected 200 OK, got 404 Not Found. Error: Failed to deploy app
	at co.cask.cdap.internal.AppFabricClient.verifyResponse(AppFabricClient.java:370)
	at co.cask.cdap.internal.AppFabricClient.deployApplication(AppFabricClient.java:428)
	at co.cask.cdap.test.UnitTestManager.deployApplication(UnitTestManager.java:199)
	at co.cask.cdap.test.TestBase.deployApplication(TestBase.java:522)
	at co.cask.hydrator.plugin.batch.ETLTPFSTestRun.testParquet(ETLTPFSTestRun.java:255)
Collapse Failed ETLTPFSTestRun testPartitionOffsetAndCleanup History
Default Job < 1 sec
java.lang.IllegalStateException: Expected 200 OK, got 404 Not Found. Error: Failed to deploy app
	at co.cask.cdap.internal.AppFabricClient.verifyResponse(AppFabricClient.java:370)
	at co.cask.cdap.internal.AppFabricClient.deployApplication(AppFabricClient.java:428)
	at co.cask.cdap.test.UnitTestManager.deployApplication(UnitTestManager.java:199)
	at co.cask.cdap.test.TestBase.deployApplication(TestBase.java:522)
	at co.cask.hydrator.plugin.batch.ETLTPFSTestRun.testPartitionOffsetAndCleanup(ETLTPFSTestRun.java:98)
Collapse Failed EmailActionTestRun testEmailAction History
Default Job < 1 sec
java.lang.IllegalStateException: Expected 200 OK, got 404 Not Found. Error: Failed to deploy app
	at co.cask.cdap.internal.AppFabricClient.verifyResponse(AppFabricClient.java:370)
	at co.cask.cdap.internal.AppFabricClient.deployApplication(AppFabricClient.java:428)
	at co.cask.cdap.test.UnitTestManager.deployApplication(UnitTestManager.java:199)
	at co.cask.cdap.test.TestBase.deployApplication(TestBase.java:522)
	at co.cask.hydrator.plugin.batch.action.EmailActionTestRun.testEmailAction(EmailActionTestRun.java:83)
Collapse Failed DedupTestRun testDedup History
Default Job < 1 sec
java.lang.IllegalStateException: Expected 200 OK, got 404 Not Found. Error: Failed to deploy app
	at co.cask.cdap.internal.AppFabricClient.verifyResponse(AppFabricClient.java:370)
	at co.cask.cdap.internal.AppFabricClient.deployApplication(AppFabricClient.java:428)
	at co.cask.cdap.test.UnitTestManager.deployApplication(UnitTestManager.java:199)
	at co.cask.cdap.test.TestBase.deployApplication(TestBase.java:522)
	at co.cask.hydrator.plugin.batch.aggregator.DedupTestRun.testDedup(DedupTestRun.java:88)
Collapse Failed GroupByTestRun testGroupBy History
Default Job < 1 sec
java.lang.IllegalStateException: Expected 200 OK, got 404 Not Found. Error: Failed to deploy app
	at co.cask.cdap.internal.AppFabricClient.verifyResponse(AppFabricClient.java:370)
	at co.cask.cdap.internal.AppFabricClient.deployApplication(AppFabricClient.java:428)
	at co.cask.cdap.test.UnitTestManager.deployApplication(UnitTestManager.java:199)
	at co.cask.cdap.test.TestBase.deployApplication(TestBase.java:522)
	at co.cask.hydrator.plugin.batch.aggregator.GroupByTestRun.testGroupBy(GroupByTestRun.java:136)
Collapse Failed ExcelInputReaderTest testWithErrorRecord History
Default Job 10 secs
java.lang.AssertionError: Expected records expected:<6> but was:<0>
	at org.junit.Assert.fail(Assert.java:88)
	at org.junit.Assert.failNotEquals(Assert.java:743)
	at org.junit.Assert.assertEquals(Assert.java:118)
	at org.junit.Assert.assertEquals(Assert.java:555)
	at co.cask.hydrator.plugin.batch.source.ExcelInputReaderTest.testWithErrorRecord(ExcelInputReaderTest.java:355)
Collapse Failed XMLReaderBatchSourceTest testXMLReaderWithNoXMLPreProcessingRequired History
Default Job 8 secs
java.lang.AssertionError: expected:<1> but was:<0>
	at org.junit.Assert.fail(Assert.java:88)
	at org.junit.Assert.failNotEquals(Assert.java:743)
	at org.junit.Assert.assertEquals(Assert.java:118)
	at org.junit.Assert.assertEquals(Assert.java:555)
	at org.junit.Assert.assertEquals(Assert.java:542)
	at co.cask.hydrator.plugin.batch.source.XMLReaderBatchSourceTest.testXMLReaderWithNoXMLPreProcessingRequired(XMLReaderBatchSourceTest.java:234)

JIRA issues

IssueDescriptionStatus
3 more issues…
Unknown Issue TypeCDAP-6744Could not obtain issue details from JIRA
Unknown Issue TypeHYDRA-125Could not obtain issue details from JIRA
Unknown Issue TypeHYDRA-169Could not obtain issue details from JIRA
Unknown Issue TypeHYDRA-176Could not obtain issue details from JIRA
Unknown Issue TypeHYDRA-327Could not obtain issue details from JIRA