Build #87

Build: #87 failed Scheduled

Stages & jobs

  1. Default Stage

Build result summary

Details

Completed
Duration
6 minutes
Labels
None
Revision
2fecaa4ef5570006bb315e7d745748791380dba6 2fecaa4ef5570006bb315e7d745748791380dba6
Total tests
7
Failing since
#45 (Changes by sagarkapare <sagar@cask.co> and Ali Anwar)

Responsible

Tests

Existing test failures 6
Status Test Failing since View job Duration
java.lang.RuntimeException: co.cask.cdap.common.ApplicationNotFoundException: 'application:default.KafkaConsumingApp.-SNAPSHOT' was not found.
	at co.cask.cdap.internal.app.services.ApplicationLifecycleService.getAppDetail(ApplicationLifecycleService.java:249)
	at co.cask.cdap.gateway.handlers.AppLifecycleHttpHandler.getAppVersionInfo(AppLifecycleHttpHandler.java:271)
	at co.cask.cdap.internal.AppFabricClient.getVersionedInfo(AppFabricClient.java:577)
	at co.cask.cdap.test.internal.DefaultApplicationManager.stopAll(DefaultApplicationManager.java:127)
	at co.cask.cdap.test.TestBase.afterTest(TestBase.java:375)
	at sun.reflect.NativeMethodAccessorImpl.invoke0(Native Method)
	at sun.reflect.NativeMethodAccessorImpl.invoke(NativeMethodAccessorImpl.java:57)
(33 more lines...)
java.lang.RuntimeException: co.cask.cdap.common.ApplicationNotFoundException: 'application:default.KafkaConsumingApp.-SNAPSHOT' was not found.
	at co.cask.cdap.internal.app.services.ApplicationLifecycleService.getAppDetail(ApplicationLifecycleService.java:249)
	at co.cask.cdap.gateway.handlers.AppLifecycleHttpHandler.getAppVersionInfo(AppLifecycleHttpHandler.java:271)
	at co.cask.cdap.internal.AppFabricClient.getVersionedInfo(AppFabricClient.java:577)
	at co.cask.cdap.test.internal.DefaultApplicationManager.stopAll(DefaultApplicationManager.java:127)
	at co.cask.cdap.test.TestBase.afterTest(TestBase.java:375)
	at sun.reflect.NativeMethodAccessorImpl.invoke0(Native Method)
	at sun.reflect.NativeMethodAccessorImpl.invoke(NativeMethodAccessorImpl.java:57)
(33 more lines...)
java.lang.RuntimeException: co.cask.cdap.common.ApplicationNotFoundException: 'application:default.KafkaConsumingApp.-SNAPSHOT' was not found.
	at co.cask.cdap.internal.app.services.ApplicationLifecycleService.getAppDetail(ApplicationLifecycleService.java:249)
	at co.cask.cdap.gateway.handlers.AppLifecycleHttpHandler.getAppVersionInfo(AppLifecycleHttpHandler.java:271)
	at co.cask.cdap.internal.AppFabricClient.getVersionedInfo(AppFabricClient.java:577)
	at co.cask.cdap.test.internal.DefaultApplicationManager.stopAll(DefaultApplicationManager.java:127)
	at co.cask.cdap.test.TestBase.afterTest(TestBase.java:375)
	at sun.reflect.NativeMethodAccessorImpl.invoke0(Native Method)
	at sun.reflect.NativeMethodAccessorImpl.invoke(NativeMethodAccessorImpl.java:57)
(33 more lines...)
java.lang.RuntimeException: co.cask.cdap.common.ApplicationNotFoundException: 'application:default.KafkaConsumingApp.-SNAPSHOT' was not found.
	at co.cask.cdap.internal.app.services.ApplicationLifecycleService.getAppDetail(ApplicationLifecycleService.java:249)
	at co.cask.cdap.gateway.handlers.AppLifecycleHttpHandler.getAppVersionInfo(AppLifecycleHttpHandler.java:271)
	at co.cask.cdap.internal.AppFabricClient.getVersionedInfo(AppFabricClient.java:577)
	at co.cask.cdap.test.internal.DefaultApplicationManager.stopAll(DefaultApplicationManager.java:127)
	at co.cask.cdap.test.TestBase.afterTest(TestBase.java:375)
	at sun.reflect.NativeMethodAccessorImpl.invoke0(Native Method)
	at sun.reflect.NativeMethodAccessorImpl.invoke(NativeMethodAccessorImpl.java:57)
(33 more lines...)
java.lang.RuntimeException: co.cask.cdap.common.ApplicationNotFoundException: 'application:default.KafkaConsumingApp.-SNAPSHOT' was not found.
	at co.cask.cdap.internal.app.services.ApplicationLifecycleService.getAppDetail(ApplicationLifecycleService.java:249)
	at co.cask.cdap.gateway.handlers.AppLifecycleHttpHandler.getAppVersionInfo(AppLifecycleHttpHandler.java:271)
	at co.cask.cdap.internal.AppFabricClient.getVersionedInfo(AppFabricClient.java:577)
	at co.cask.cdap.test.internal.DefaultApplicationManager.stopAll(DefaultApplicationManager.java:127)
	at co.cask.cdap.test.TestBase.afterTest(TestBase.java:375)
	at sun.reflect.NativeMethodAccessorImpl.invoke0(Native Method)
	at sun.reflect.NativeMethodAccessorImpl.invoke(NativeMethodAccessorImpl.java:57)
(33 more lines...)
java.lang.RuntimeException: co.cask.cdap.common.ApplicationNotFoundException: 'application:default.KafkaConsumingApp.-SNAPSHOT' was not found.
	at co.cask.cdap.internal.app.services.ApplicationLifecycleService.getAppDetail(ApplicationLifecycleService.java:249)
	at co.cask.cdap.gateway.handlers.AppLifecycleHttpHandler.getAppVersionInfo(AppLifecycleHttpHandler.java:271)
	at co.cask.cdap.internal.AppFabricClient.getVersionedInfo(AppFabricClient.java:577)
	at co.cask.cdap.test.internal.DefaultApplicationManager.stopAll(DefaultApplicationManager.java:127)
	at co.cask.cdap.test.TestBase.afterTest(TestBase.java:375)
	at sun.reflect.NativeMethodAccessorImpl.invoke0(Native Method)
	at sun.reflect.NativeMethodAccessorImpl.invoke(NativeMethodAccessorImpl.java:57)
(33 more lines...)