Build #86

Build: #86 failed

Job: Kafka Build and Deploy failed

Stages & jobs

  1. Default Stage

Job result summary

Completed
Duration
5 minutes
Agent
bamboo-agent04
Revision
2fecaa4ef5570006bb315e7d745748791380dba6 2fecaa4ef5570006bb315e7d745748791380dba6
Total tests
6
Failing since
#45 (Code changes detected – )

Tests

  • 6 tests in total
  • 6 tests failed
  • 3 minutes taken in total.
Existing test failures 6
Status Test Failing since Duration
java.lang.RuntimeException: co.cask.cdap.common.ApplicationNotFoundException: 'application:default.KafkaConsumingApp.-SNAPSHOT' was not found.
	at co.cask.cdap.internal.app.services.ApplicationLifecycleService.getAppDetail(ApplicationLifecycleService.java:249)
	at co.cask.cdap.gateway.handlers.AppLifecycleHttpHandler.getAppVersionInfo(AppLifecycleHttpHandler.java:271)
	at co.cask.cdap.internal.AppFabricClient.getVersionedInfo(AppFabricClient.java:577)
	at co.cask.cdap.test.internal.DefaultApplicationManager.stopAll(DefaultApplicationManager.java:127)
	at co.cask.cdap.test.TestBase.afterTest(TestBase.java:375)
	at sun.reflect.NativeMethodAccessorImpl.invoke0(Native Method)
	at sun.reflect.NativeMethodAccessorImpl.invoke(NativeMethodAccessorImpl.java:57)
(33 more lines...)
java.lang.RuntimeException: co.cask.cdap.common.ApplicationNotFoundException: 'application:default.KafkaConsumingApp.-SNAPSHOT' was not found.
	at co.cask.cdap.internal.app.services.ApplicationLifecycleService.getAppDetail(ApplicationLifecycleService.java:249)
	at co.cask.cdap.gateway.handlers.AppLifecycleHttpHandler.getAppVersionInfo(AppLifecycleHttpHandler.java:271)
	at co.cask.cdap.internal.AppFabricClient.getVersionedInfo(AppFabricClient.java:577)
	at co.cask.cdap.test.internal.DefaultApplicationManager.stopAll(DefaultApplicationManager.java:127)
	at co.cask.cdap.test.TestBase.afterTest(TestBase.java:375)
	at sun.reflect.NativeMethodAccessorImpl.invoke0(Native Method)
	at sun.reflect.NativeMethodAccessorImpl.invoke(NativeMethodAccessorImpl.java:57)
(33 more lines...)
java.lang.RuntimeException: co.cask.cdap.common.ApplicationNotFoundException: 'application:default.KafkaConsumingApp.-SNAPSHOT' was not found.
	at co.cask.cdap.internal.app.services.ApplicationLifecycleService.getAppDetail(ApplicationLifecycleService.java:249)
	at co.cask.cdap.gateway.handlers.AppLifecycleHttpHandler.getAppVersionInfo(AppLifecycleHttpHandler.java:271)
	at co.cask.cdap.internal.AppFabricClient.getVersionedInfo(AppFabricClient.java:577)
	at co.cask.cdap.test.internal.DefaultApplicationManager.stopAll(DefaultApplicationManager.java:127)
	at co.cask.cdap.test.TestBase.afterTest(TestBase.java:375)
	at sun.reflect.NativeMethodAccessorImpl.invoke0(Native Method)
	at sun.reflect.NativeMethodAccessorImpl.invoke(NativeMethodAccessorImpl.java:57)
(33 more lines...)
java.lang.RuntimeException: co.cask.cdap.common.ApplicationNotFoundException: 'application:default.KafkaConsumingApp.-SNAPSHOT' was not found.
	at co.cask.cdap.internal.app.services.ApplicationLifecycleService.getAppDetail(ApplicationLifecycleService.java:249)
	at co.cask.cdap.gateway.handlers.AppLifecycleHttpHandler.getAppVersionInfo(AppLifecycleHttpHandler.java:271)
	at co.cask.cdap.internal.AppFabricClient.getVersionedInfo(AppFabricClient.java:577)
	at co.cask.cdap.test.internal.DefaultApplicationManager.stopAll(DefaultApplicationManager.java:127)
	at co.cask.cdap.test.TestBase.afterTest(TestBase.java:375)
	at sun.reflect.NativeMethodAccessorImpl.invoke0(Native Method)
	at sun.reflect.NativeMethodAccessorImpl.invoke(NativeMethodAccessorImpl.java:57)
(33 more lines...)
java.lang.RuntimeException: co.cask.cdap.common.ApplicationNotFoundException: 'application:default.KafkaConsumingApp.-SNAPSHOT' was not found.
	at co.cask.cdap.internal.app.services.ApplicationLifecycleService.getAppDetail(ApplicationLifecycleService.java:249)
	at co.cask.cdap.gateway.handlers.AppLifecycleHttpHandler.getAppVersionInfo(AppLifecycleHttpHandler.java:271)
	at co.cask.cdap.internal.AppFabricClient.getVersionedInfo(AppFabricClient.java:577)
	at co.cask.cdap.test.internal.DefaultApplicationManager.stopAll(DefaultApplicationManager.java:127)
	at co.cask.cdap.test.TestBase.afterTest(TestBase.java:375)
	at sun.reflect.NativeMethodAccessorImpl.invoke0(Native Method)
	at sun.reflect.NativeMethodAccessorImpl.invoke(NativeMethodAccessorImpl.java:57)
(33 more lines...)
java.lang.RuntimeException: co.cask.cdap.common.ApplicationNotFoundException: 'application:default.KafkaConsumingApp.-SNAPSHOT' was not found.
	at co.cask.cdap.internal.app.services.ApplicationLifecycleService.getAppDetail(ApplicationLifecycleService.java:249)
	at co.cask.cdap.gateway.handlers.AppLifecycleHttpHandler.getAppVersionInfo(AppLifecycleHttpHandler.java:271)
	at co.cask.cdap.internal.AppFabricClient.getVersionedInfo(AppFabricClient.java:577)
	at co.cask.cdap.test.internal.DefaultApplicationManager.stopAll(DefaultApplicationManager.java:127)
	at co.cask.cdap.test.TestBase.afterTest(TestBase.java:375)
	at sun.reflect.NativeMethodAccessorImpl.invoke0(Native Method)
	at sun.reflect.NativeMethodAccessorImpl.invoke(NativeMethodAccessorImpl.java:57)
(33 more lines...)

Error summary

The build generated some errors. See the full build log for more details.

Warning:  org.apache.xerces.jaxp.SAXParserImpl$JAXPSAXParser: Property 'http://www.oracle.com/xml/jaxp/properties/entityExpansionLimit' is not recognized.
Compiler warnings:
  WARNING:  'org.apache.xerces.jaxp.SAXParserImpl: Property 'http://javax.xml.XMLConstants/property/accessExternalDTD' is not recognized.'
Warning:  org.apache.xerces.parsers.SAXParser: Feature 'http://javax.xml.XMLConstants/feature/secure-processing' is not recognized.
Warning:  org.apache.xerces.parsers.SAXParser: Property 'http://javax.xml.XMLConstants/property/accessExternalDTD' is not recognized.
Warning:  org.apache.xerces.parsers.SAXParser: Property 'http://www.oracle.com/xml/jaxp/properties/entityExpansionLimit' is not recognized.
Warning:  org.apache.xerces.jaxp.SAXParserImpl$JAXPSAXParser: Property 'http://www.oracle.com/xml/jaxp/properties/entityExpansionLimit' is not recognized.
Compiler warnings:
  WARNING:  'org.apache.xerces.jaxp.SAXParserImpl: Property 'http://javax.xml.XMLConstants/property/accessExternalDTD' is not recognized.'
Warning:  org.apache.xerces.parsers.SAXParser: Feature 'http://javax.xml.XMLConstants/feature/secure-processing' is not recognized.
Warning:  org.apache.xerces.parsers.SAXParser: Property 'http://javax.xml.XMLConstants/property/accessExternalDTD' is not recognized.
Warning:  org.apache.xerces.parsers.SAXParser: Property 'http://www.oracle.com/xml/jaxp/properties/entityExpansionLimit' is not recognized.
Warning:  org.apache.xerces.jaxp.SAXParserImpl$JAXPSAXParser: Property 'http://www.oracle.com/xml/jaxp/properties/entityExpansionLimit' is not recognized.
Compiler warnings:
  WARNING:  'org.apache.xerces.jaxp.SAXParserImpl: Property 'http://javax.xml.XMLConstants/property/accessExternalDTD' is not recognized.'
Warning:  org.apache.xerces.parsers.SAXParser: Feature 'http://javax.xml.XMLConstants/feature/secure-processing' is not recognized.
Warning:  org.apache.xerces.parsers.SAXParser: Property 'http://javax.xml.XMLConstants/property/accessExternalDTD' is not recognized.
Warning:  org.apache.xerces.parsers.SAXParser: Property 'http://www.oracle.com/xml/jaxp/properties/entityExpansionLimit' is not recognized.
Warning:  org.apache.xerces.jaxp.SAXParserImpl$JAXPSAXParser: Property 'http://www.oracle.com/xml/jaxp/properties/entityExpansionLimit' is not recognized.
Compiler warnings:
  WARNING:  'org.apache.xerces.jaxp.SAXParserImpl: Property 'http://javax.xml.XMLConstants/property/accessExternalDTD' is not recognized.'
Warning:  org.apache.xerces.parsers.SAXParser: Feature 'http://javax.xml.XMLConstants/feature/secure-processing' is not recognized.
Warning:  org.apache.xerces.parsers.SAXParser: Property 'http://javax.xml.XMLConstants/property/accessExternalDTD' is not recognized.
Warning:  org.apache.xerces.parsers.SAXParser: Property 'http://www.oracle.com/xml/jaxp/properties/entityExpansionLimit' is not recognized.
Warning:  org.apache.xerces.jaxp.SAXParserImpl$JAXPSAXParser: Property 'http://www.oracle.com/xml/jaxp/properties/entityExpansionLimit' is not recognized.
Compiler warnings:
  WARNING:  'org.apache.xerces.jaxp.SAXParserImpl: Property 'http://javax.xml.XMLConstants/property/accessExternalDTD' is not recognized.'
Warning:  org.apache.xerces.parsers.SAXParser: Feature 'http://javax.xml.XMLConstants/feature/secure-processing' is not recognized.
Warning:  org.apache.xerces.parsers.SAXParser: Property 'http://javax.xml.XMLConstants/property/accessExternalDTD' is not recognized.
Warning:  org.apache.xerces.parsers.SAXParser: Property 'http://www.oracle.com/xml/jaxp/properties/entityExpansionLimit' is not recognized.
Warning:  org.apache.xerces.jaxp.SAXParserImpl$JAXPSAXParser: Property 'http://www.oracle.com/xml/jaxp/properties/entityExpansionLimit' is not recognized.
Compiler warnings:
  WARNING:  'org.apache.xerces.jaxp.SAXParserImpl: Property 'http://javax.xml.XMLConstants/property/accessExternalDTD' is not recognized.'
Warning:  org.apache.xerces.parsers.SAXParser: Feature 'http://javax.xml.XMLConstants/feature/secure-processing' is not recognized.
Warning:  org.apache.xerces.parsers.SAXParser: Property 'http://javax.xml.XMLConstants/property/accessExternalDTD' is not recognized.
Warning:  org.apache.xerces.parsers.SAXParser: Property 'http://www.oracle.com/xml/jaxp/properties/entityExpansionLimit' is not recognized.
Warning:  org.apache.xerces.jaxp.SAXParserImpl$JAXPSAXParser: Property 'http://www.oracle.com/xml/jaxp/properties/entityExpansionLimit' is not recognized.
Compiler warnings:
  WARNING:  'org.apache.xerces.jaxp.SAXParserImpl: Property 'http://javax.xml.XMLConstants/property/accessExternalDTD' is not recognized.'
Warning:  org.apache.xerces.parsers.SAXParser: Feature 'http://javax.xml.XMLConstants/feature/secure-processing' is not recognized.
Warning:  org.apache.xerces.parsers.SAXParser: Property 'http://javax.xml.XMLConstants/property/accessExternalDTD' is not recognized.
Warning:  org.apache.xerces.parsers.SAXParser: Property 'http://www.oracle.com/xml/jaxp/properties/entityExpansionLimit' is not recognized.
SLF4J: Class path contains multiple SLF4J bindings.
SLF4J: Found binding in [jar:file:/home/bamboo/.m2/repository/co/cask/cdap/cdap-explore-jdbc/4.3.0-SNAPSHOT/cdap-explore-jdbc-4.3.0-SNAPSHOT.jar!/org/slf4j/impl/StaticLoggerBinder.class]
SLF4J: Found binding in [jar:file:/home/bamboo/.m2/repository/ch/qos/logback/logback-classic/1.1.2/logback-classic-1.1.2.jar!/org/slf4j/impl/StaticLoggerBinder.class]
SLF4J: See http://www.slf4j.org/codes.html#multiple_bindings for an explanation.
SLF4J: Actual binding is of type [ch.qos.logback.classic.util.ContextSelectorStaticBinder]
SLF4J: Class path contains multiple SLF4J bindings.
SLF4J: Found binding in [jar:file:/home/bamboo/.m2/repository/co/cask/cdap/cdap-explore-jdbc/4.3.0-SNAPSHOT/cdap-explore-jdbc-4.3.0-SNAPSHOT.jar!/org/slf4j/impl/StaticLoggerBinder.class]
SLF4J: Found binding in [jar:file:/home/bamboo/.m2/repository/ch/qos/logback/logback-classic/1.1.2/logback-classic-1.1.2.jar!/org/slf4j/impl/StaticLoggerBinder.class]
SLF4J: See http://www.slf4j.org/codes.html#multiple_bindings for an explanation.
SLF4J: Actual binding is of type [ch.qos.logback.classic.util.ContextSelectorStaticBinder]
log4j:WARN No appenders could be found for logger (DataNucleus.General).
log4j:WARN Please initialize the log4j system properly.
log4j:WARN See http://logging.apache.org/log4j/1.2/faq.html#noconfig for more info.