Build #144

Build: #144 failed

Job: Kafka Build and Deploy failed

Stages & jobs

  1. Default Stage

Job result summary

Completed
Duration
4 minutes
Agent
bamboo-agent19
Revision
19359ef0e036f77b0a12c79ef3563e8606ce8836 19359ef0e036f77b0a12c79ef3563e8606ce8836
Total tests
6
Failing since
#45 (Code changes detected – )

Tests

  • 6 tests in total
  • 6 tests failed
  • 3 minutes taken in total.
Existing test failures 6
Status Test Failing since Duration
java.lang.RuntimeException: co.cask.cdap.common.ApplicationNotFoundException: 'application:default.KafkaConsumingApp.-SNAPSHOT' was not found.
	at co.cask.cdap.internal.app.services.ApplicationLifecycleService.getAppDetail(ApplicationLifecycleService.java:249)
	at co.cask.cdap.gateway.handlers.AppLifecycleHttpHandler.getAppVersionInfo(AppLifecycleHttpHandler.java:271)
	at co.cask.cdap.internal.AppFabricClient.getVersionedInfo(AppFabricClient.java:577)
	at co.cask.cdap.test.internal.DefaultApplicationManager.stopAll(DefaultApplicationManager.java:127)
	at co.cask.cdap.test.TestBase.afterTest(TestBase.java:375)
	at sun.reflect.NativeMethodAccessorImpl.invoke0(Native Method)
	at sun.reflect.NativeMethodAccessorImpl.invoke(NativeMethodAccessorImpl.java:57)
(34 more lines...)
java.lang.RuntimeException: co.cask.cdap.common.ApplicationNotFoundException: 'application:default.KafkaConsumingApp.-SNAPSHOT' was not found.
	at co.cask.cdap.internal.app.services.ApplicationLifecycleService.getAppDetail(ApplicationLifecycleService.java:249)
	at co.cask.cdap.gateway.handlers.AppLifecycleHttpHandler.getAppVersionInfo(AppLifecycleHttpHandler.java:271)
	at co.cask.cdap.internal.AppFabricClient.getVersionedInfo(AppFabricClient.java:577)
	at co.cask.cdap.test.internal.DefaultApplicationManager.stopAll(DefaultApplicationManager.java:127)
	at co.cask.cdap.test.TestBase.afterTest(TestBase.java:375)
	at sun.reflect.NativeMethodAccessorImpl.invoke0(Native Method)
	at sun.reflect.NativeMethodAccessorImpl.invoke(NativeMethodAccessorImpl.java:57)
(34 more lines...)
java.lang.RuntimeException: co.cask.cdap.common.ApplicationNotFoundException: 'application:default.KafkaConsumingApp.-SNAPSHOT' was not found.
	at co.cask.cdap.internal.app.services.ApplicationLifecycleService.getAppDetail(ApplicationLifecycleService.java:249)
	at co.cask.cdap.gateway.handlers.AppLifecycleHttpHandler.getAppVersionInfo(AppLifecycleHttpHandler.java:271)
	at co.cask.cdap.internal.AppFabricClient.getVersionedInfo(AppFabricClient.java:577)
	at co.cask.cdap.test.internal.DefaultApplicationManager.stopAll(DefaultApplicationManager.java:127)
	at co.cask.cdap.test.TestBase.afterTest(TestBase.java:375)
	at sun.reflect.NativeMethodAccessorImpl.invoke0(Native Method)
	at sun.reflect.NativeMethodAccessorImpl.invoke(NativeMethodAccessorImpl.java:57)
(34 more lines...)
java.util.concurrent.TimeoutException: Time limit reached: Expected '10' but got '0'
	at co.cask.cdap.test.MetricsManager.waitForTotalMetricCount(MetricsManager.java:149)
	at co.cask.cdap.test.MetricsManager$1.waitForProcessed(MetricsManager.java:191)
	at co.cask.cdap.kafka.flow.KafkaConsumerFlowletTestBase.testInvalidStartOffsetSmaller(KafkaConsumerFlowletTestBase.java:318)
	at sun.reflect.NativeMethodAccessorImpl.invoke0(Native Method)
	at sun.reflect.NativeMethodAccessorImpl.invoke(NativeMethodAccessorImpl.java:57)
	at sun.reflect.DelegatingMethodAccessorImpl.invoke(DelegatingMethodAccessorImpl.java:43)
	at java.lang.reflect.Method.invoke(Method.java:606)
(34 more lines...)
java.util.concurrent.TimeoutException: Time limit reached: Expected '100' but got '0'
	at co.cask.cdap.test.MetricsManager.waitForTotalMetricCount(MetricsManager.java:149)
	at co.cask.cdap.test.MetricsManager$1.waitForProcessed(MetricsManager.java:191)
	at co.cask.cdap.kafka.flow.KafkaConsumerFlowletTestBase.runFlow(KafkaConsumerFlowletTestBase.java:400)
	at co.cask.cdap.kafka.flow.KafkaConsumerFlowletTestBase.testProcessingLimits(KafkaConsumerFlowletTestBase.java:369)
	at sun.reflect.NativeMethodAccessorImpl.invoke0(Native Method)
	at sun.reflect.NativeMethodAccessorImpl.invoke(NativeMethodAccessorImpl.java:57)
	at sun.reflect.DelegatingMethodAccessorImpl.invoke(DelegatingMethodAccessorImpl.java:43)
(35 more lines...)
java.lang.RuntimeException: co.cask.cdap.common.ApplicationNotFoundException: 'application:default.KafkaConsumingApp.-SNAPSHOT' was not found.
	at co.cask.cdap.internal.app.services.ApplicationLifecycleService.getAppDetail(ApplicationLifecycleService.java:249)
	at co.cask.cdap.gateway.handlers.AppLifecycleHttpHandler.getAppVersionInfo(AppLifecycleHttpHandler.java:271)
	at co.cask.cdap.internal.AppFabricClient.getVersionedInfo(AppFabricClient.java:577)
	at co.cask.cdap.test.internal.DefaultApplicationManager.stopAll(DefaultApplicationManager.java:127)
	at co.cask.cdap.test.TestBase.afterTest(TestBase.java:375)
	at sun.reflect.NativeMethodAccessorImpl.invoke0(Native Method)
	at sun.reflect.NativeMethodAccessorImpl.invoke(NativeMethodAccessorImpl.java:57)
(34 more lines...)

Error summary

The build generated some errors. See the full build log for more details.

Warning:  org.apache.xerces.jaxp.SAXParserImpl$JAXPSAXParser: Property 'http://www.oracle.com/xml/jaxp/properties/entityExpansionLimit' is not recognized.
Compiler warnings:
  WARNING:  'org.apache.xerces.jaxp.SAXParserImpl: Property 'http://javax.xml.XMLConstants/property/accessExternalDTD' is not recognized.'
Warning:  org.apache.xerces.parsers.SAXParser: Feature 'http://javax.xml.XMLConstants/feature/secure-processing' is not recognized.
Warning:  org.apache.xerces.parsers.SAXParser: Property 'http://javax.xml.XMLConstants/property/accessExternalDTD' is not recognized.
Warning:  org.apache.xerces.parsers.SAXParser: Property 'http://www.oracle.com/xml/jaxp/properties/entityExpansionLimit' is not recognized.
Warning:  org.apache.xerces.jaxp.SAXParserImpl$JAXPSAXParser: Property 'http://www.oracle.com/xml/jaxp/properties/entityExpansionLimit' is not recognized.
Compiler warnings:
  WARNING:  'org.apache.xerces.jaxp.SAXParserImpl: Property 'http://javax.xml.XMLConstants/property/accessExternalDTD' is not recognized.'
Warning:  org.apache.xerces.parsers.SAXParser: Feature 'http://javax.xml.XMLConstants/feature/secure-processing' is not recognized.
Warning:  org.apache.xerces.parsers.SAXParser: Property 'http://javax.xml.XMLConstants/property/accessExternalDTD' is not recognized.
Warning:  org.apache.xerces.parsers.SAXParser: Property 'http://www.oracle.com/xml/jaxp/properties/entityExpansionLimit' is not recognized.
Warning:  org.apache.xerces.jaxp.SAXParserImpl$JAXPSAXParser: Property 'http://www.oracle.com/xml/jaxp/properties/entityExpansionLimit' is not recognized.
Compiler warnings:
  WARNING:  'org.apache.xerces.jaxp.SAXParserImpl: Property 'http://javax.xml.XMLConstants/property/accessExternalDTD' is not recognized.'
Warning:  org.apache.xerces.parsers.SAXParser: Feature 'http://javax.xml.XMLConstants/feature/secure-processing' is not recognized.
Warning:  org.apache.xerces.parsers.SAXParser: Property 'http://javax.xml.XMLConstants/property/accessExternalDTD' is not recognized.
Warning:  org.apache.xerces.parsers.SAXParser: Property 'http://www.oracle.com/xml/jaxp/properties/entityExpansionLimit' is not recognized.
Warning:  org.apache.xerces.jaxp.SAXParserImpl$JAXPSAXParser: Property 'http://www.oracle.com/xml/jaxp/properties/entityExpansionLimit' is not recognized.
Compiler warnings:
  WARNING:  'org.apache.xerces.jaxp.SAXParserImpl: Property 'http://javax.xml.XMLConstants/property/accessExternalDTD' is not recognized.'
Warning:  org.apache.xerces.parsers.SAXParser: Feature 'http://javax.xml.XMLConstants/feature/secure-processing' is not recognized.
Warning:  org.apache.xerces.parsers.SAXParser: Property 'http://javax.xml.XMLConstants/property/accessExternalDTD' is not recognized.
Warning:  org.apache.xerces.parsers.SAXParser: Property 'http://www.oracle.com/xml/jaxp/properties/entityExpansionLimit' is not recognized.
Warning:  org.apache.xerces.jaxp.SAXParserImpl$JAXPSAXParser: Property 'http://www.oracle.com/xml/jaxp/properties/entityExpansionLimit' is not recognized.
Compiler warnings:
  WARNING:  'org.apache.xerces.jaxp.SAXParserImpl: Property 'http://javax.xml.XMLConstants/property/accessExternalDTD' is not recognized.'
Warning:  org.apache.xerces.parsers.SAXParser: Feature 'http://javax.xml.XMLConstants/feature/secure-processing' is not recognized.
Warning:  org.apache.xerces.parsers.SAXParser: Property 'http://javax.xml.XMLConstants/property/accessExternalDTD' is not recognized.
Warning:  org.apache.xerces.parsers.SAXParser: Property 'http://www.oracle.com/xml/jaxp/properties/entityExpansionLimit' is not recognized.
Warning:  org.apache.xerces.jaxp.SAXParserImpl$JAXPSAXParser: Property 'http://www.oracle.com/xml/jaxp/properties/entityExpansionLimit' is not recognized.
Compiler warnings:
  WARNING:  'org.apache.xerces.jaxp.SAXParserImpl: Property 'http://javax.xml.XMLConstants/property/accessExternalDTD' is not recognized.'
Warning:  org.apache.xerces.parsers.SAXParser: Feature 'http://javax.xml.XMLConstants/feature/secure-processing' is not recognized.
Warning:  org.apache.xerces.parsers.SAXParser: Property 'http://javax.xml.XMLConstants/property/accessExternalDTD' is not recognized.
Warning:  org.apache.xerces.parsers.SAXParser: Property 'http://www.oracle.com/xml/jaxp/properties/entityExpansionLimit' is not recognized.
Warning:  org.apache.xerces.jaxp.SAXParserImpl$JAXPSAXParser: Property 'http://www.oracle.com/xml/jaxp/properties/entityExpansionLimit' is not recognized.
Compiler warnings:
  WARNING:  'org.apache.xerces.jaxp.SAXParserImpl: Property 'http://javax.xml.XMLConstants/property/accessExternalDTD' is not recognized.'
Warning:  org.apache.xerces.parsers.SAXParser: Feature 'http://javax.xml.XMLConstants/feature/secure-processing' is not recognized.
Warning:  org.apache.xerces.parsers.SAXParser: Property 'http://javax.xml.XMLConstants/property/accessExternalDTD' is not recognized.
Warning:  org.apache.xerces.parsers.SAXParser: Property 'http://www.oracle.com/xml/jaxp/properties/entityExpansionLimit' is not recognized.
SLF4J: Class path contains multiple SLF4J bindings.
SLF4J: Found binding in [jar:file:/home/bamboo/.m2/repository/co/cask/cdap/cdap-explore-jdbc/4.3.0-SNAPSHOT/cdap-explore-jdbc-4.3.0-SNAPSHOT.jar!/org/slf4j/impl/StaticLoggerBinder.class]
SLF4J: Found binding in [jar:file:/home/bamboo/.m2/repository/ch/qos/logback/logback-classic/1.1.2/logback-classic-1.1.2.jar!/org/slf4j/impl/StaticLoggerBinder.class]
SLF4J: See http://www.slf4j.org/codes.html#multiple_bindings for an explanation.
SLF4J: Actual binding is of type [ch.qos.logback.classic.util.ContextSelectorStaticBinder]
SLF4J: Class path contains multiple SLF4J bindings.
SLF4J: Found binding in [jar:file:/home/bamboo/.m2/repository/co/cask/cdap/cdap-explore-jdbc/4.3.0-SNAPSHOT/cdap-explore-jdbc-4.3.0-SNAPSHOT.jar!/org/slf4j/impl/StaticLoggerBinder.class]
SLF4J: Found binding in [jar:file:/home/bamboo/.m2/repository/ch/qos/logback/logback-classic/1.1.2/logback-classic-1.1.2.jar!/org/slf4j/impl/StaticLoggerBinder.class]
SLF4J: See http://www.slf4j.org/codes.html#multiple_bindings for an explanation.
SLF4J: Actual binding is of type [ch.qos.logback.classic.util.ContextSelectorStaticBinder]
log4j:WARN No appenders could be found for logger (kafka.utils.VerifiableProperties).
log4j:WARN Please initialize the log4j system properly.
log4j:WARN See http://logging.apache.org/log4j/1.2/faq.html#noconfig for more info.