Build #46

Build: #46 failed Scheduled

Stages & jobs

  1. Default Stage

Build result summary

Details

Completed
Duration
5 minutes
Labels
None
Revision
e7b7c1fd59d877f0795cbe43d847ada012ee77f6 e7b7c1fd59d877f0795cbe43d847ada012ee77f6
Total tests
7
Failing since
#45 (Changes by Ali Anwar and sagarkapare <sagar@cask.co>)

Responsible

Tests

New test failures 6
Status Test View job Duration
Collapse Failed Kafka08ConsumerFlowletTest testInvalidStartOffsetSmaller History
Kafka Build and Deploy 1 min
java.lang.RuntimeException: co.cask.cdap.common.ApplicationNotFoundException: 'application:default.KafkaConsumingApp.-SNAPSHOT' was not found.
	at co.cask.cdap.internal.app.services.ApplicationLifecycleService.getAppDetail(ApplicationLifecycleService.java:251)
	at co.cask.cdap.gateway.handlers.AppLifecycleHttpHandler.getAppVersionInfo(AppLifecycleHttpHandler.java:268)
	at co.cask.cdap.internal.AppFabricClient.getVersionedInfo(AppFabricClient.java:528)
	at co.cask.cdap.test.internal.DefaultApplicationManager.stopAll(DefaultApplicationManager.java:119)
	at co.cask.cdap.test.TestBase.afterTest(TestBase.java:375)
	at sun.reflect.NativeMethodAccessorImpl.invoke0(Native Method)
	at sun.reflect.NativeMethodAccessorImpl.invoke(NativeMethodAccessorImpl.java:57)
(33 more lines...)
Collapse Failed Kafka08ConsumerFlowletTest testProcessingLimits History
Kafka Build and Deploy 49 secs
java.lang.AssertionError: null
	at org.junit.Assert.fail(Assert.java:86)
	at org.junit.Assert.fail(Assert.java:95)
	at co.cask.cdap.kafka.flow.KafkaConsumerFlowletTestBase.testProcessingLimits(KafkaConsumerFlowletTestBase.java:377)
	at sun.reflect.NativeMethodAccessorImpl.invoke0(Native Method)
	at sun.reflect.NativeMethodAccessorImpl.invoke(NativeMethodAccessorImpl.java:57)
	at sun.reflect.DelegatingMethodAccessorImpl.invoke(DelegatingMethodAccessorImpl.java:43)
	at java.lang.reflect.Method.invoke(Method.java:606)
(33 more lines...)
Collapse Failed Kafka08ConsumerFlowletTest testStartOffset History
Kafka Build and Deploy 10 secs
java.lang.RuntimeException: co.cask.cdap.common.ApplicationNotFoundException: 'application:default.KafkaConsumingApp.-SNAPSHOT' was not found.
	at co.cask.cdap.internal.app.services.ApplicationLifecycleService.getAppDetail(ApplicationLifecycleService.java:251)
	at co.cask.cdap.gateway.handlers.AppLifecycleHttpHandler.getAppVersionInfo(AppLifecycleHttpHandler.java:268)
	at co.cask.cdap.internal.AppFabricClient.getVersionedInfo(AppFabricClient.java:528)
	at co.cask.cdap.test.internal.DefaultApplicationManager.stopAll(DefaultApplicationManager.java:119)
	at co.cask.cdap.test.TestBase.afterTest(TestBase.java:375)
	at sun.reflect.NativeMethodAccessorImpl.invoke0(Native Method)
	at sun.reflect.NativeMethodAccessorImpl.invoke(NativeMethodAccessorImpl.java:57)
(33 more lines...)
Collapse Failed Kafka08ConsumerFlowletTest testFlowlet History
Kafka Build and Deploy 13 secs
java.lang.RuntimeException: co.cask.cdap.common.ApplicationNotFoundException: 'application:default.KafkaConsumingApp.-SNAPSHOT' was not found.
	at co.cask.cdap.internal.app.services.ApplicationLifecycleService.getAppDetail(ApplicationLifecycleService.java:251)
	at co.cask.cdap.gateway.handlers.AppLifecycleHttpHandler.getAppVersionInfo(AppLifecycleHttpHandler.java:268)
	at co.cask.cdap.internal.AppFabricClient.getVersionedInfo(AppFabricClient.java:528)
	at co.cask.cdap.test.internal.DefaultApplicationManager.stopAll(DefaultApplicationManager.java:119)
	at co.cask.cdap.test.TestBase.afterTest(TestBase.java:375)
	at sun.reflect.NativeMethodAccessorImpl.invoke0(Native Method)
	at sun.reflect.NativeMethodAccessorImpl.invoke(NativeMethodAccessorImpl.java:57)
(33 more lines...)
Collapse Failed Kafka08ConsumerFlowletTest testChangeInstances History
Kafka Build and Deploy 9 secs
java.lang.RuntimeException: co.cask.cdap.common.ApplicationNotFoundException: 'application:default.KafkaConsumingApp.-SNAPSHOT' was not found.
	at co.cask.cdap.internal.app.services.ApplicationLifecycleService.getAppDetail(ApplicationLifecycleService.java:251)
	at co.cask.cdap.gateway.handlers.AppLifecycleHttpHandler.getAppVersionInfo(AppLifecycleHttpHandler.java:268)
	at co.cask.cdap.internal.AppFabricClient.getVersionedInfo(AppFabricClient.java:528)
	at co.cask.cdap.test.internal.DefaultApplicationManager.stopAll(DefaultApplicationManager.java:119)
	at co.cask.cdap.test.TestBase.afterTest(TestBase.java:375)
	at sun.reflect.NativeMethodAccessorImpl.invoke0(Native Method)
	at sun.reflect.NativeMethodAccessorImpl.invoke(NativeMethodAccessorImpl.java:57)
(33 more lines...)
Collapse Failed Kafka08ConsumerFlowletTest testInvalidStartOffsetLarger History
Kafka Build and Deploy 10 secs
java.lang.RuntimeException: co.cask.cdap.common.ApplicationNotFoundException: 'application:default.KafkaConsumingApp.-SNAPSHOT' was not found.
	at co.cask.cdap.internal.app.services.ApplicationLifecycleService.getAppDetail(ApplicationLifecycleService.java:251)
	at co.cask.cdap.gateway.handlers.AppLifecycleHttpHandler.getAppVersionInfo(AppLifecycleHttpHandler.java:268)
	at co.cask.cdap.internal.AppFabricClient.getVersionedInfo(AppFabricClient.java:528)
	at co.cask.cdap.test.internal.DefaultApplicationManager.stopAll(DefaultApplicationManager.java:119)
	at co.cask.cdap.test.TestBase.afterTest(TestBase.java:375)
	at sun.reflect.NativeMethodAccessorImpl.invoke0(Native Method)
	at sun.reflect.NativeMethodAccessorImpl.invoke(NativeMethodAccessorImpl.java:57)
(33 more lines...)