Build #134

Build: #134 failed Scheduled

Stages & jobs

  1. Default Stage

Build result summary

Details

Completed
Duration
4 minutes
Labels
None
Revision
19359ef0e036f77b0a12c79ef3563e8606ce8836 19359ef0e036f77b0a12c79ef3563e8606ce8836
Total tests
7
Failing since
#45 (Changes by Ali Anwar and sagarkapare <sagar@cask.co>)

Responsible

Configuration changes

Plan configuration has changed since the last successful build. See the plan audit log for more details.

Tests

Existing test failures 6
Status Test Failing since View job Duration
java.util.concurrent.TimeoutException: Time limit reached: Expected '10' but got '0'
	at co.cask.cdap.test.MetricsManager.waitForTotalMetricCount(MetricsManager.java:149)
	at co.cask.cdap.test.MetricsManager$1.waitForProcessed(MetricsManager.java:191)
	at co.cask.cdap.kafka.flow.KafkaConsumerFlowletTestBase.testInvalidStartOffsetSmaller(KafkaConsumerFlowletTestBase.java:318)
	at sun.reflect.NativeMethodAccessorImpl.invoke0(Native Method)
	at sun.reflect.NativeMethodAccessorImpl.invoke(NativeMethodAccessorImpl.java:57)
	at sun.reflect.DelegatingMethodAccessorImpl.invoke(DelegatingMethodAccessorImpl.java:43)
	at java.lang.reflect.Method.invoke(Method.java:606)
(34 more lines...)
java.util.concurrent.TimeoutException: Time limit reached: Expected '100' but got '0'
	at co.cask.cdap.test.MetricsManager.waitForTotalMetricCount(MetricsManager.java:149)
	at co.cask.cdap.test.MetricsManager$1.waitForProcessed(MetricsManager.java:191)
	at co.cask.cdap.kafka.flow.KafkaConsumerFlowletTestBase.runFlow(KafkaConsumerFlowletTestBase.java:400)
	at co.cask.cdap.kafka.flow.KafkaConsumerFlowletTestBase.testProcessingLimits(KafkaConsumerFlowletTestBase.java:369)
	at sun.reflect.NativeMethodAccessorImpl.invoke0(Native Method)
	at sun.reflect.NativeMethodAccessorImpl.invoke(NativeMethodAccessorImpl.java:57)
	at sun.reflect.DelegatingMethodAccessorImpl.invoke(DelegatingMethodAccessorImpl.java:43)
(35 more lines...)
java.lang.RuntimeException: co.cask.cdap.common.ApplicationNotFoundException: 'application:default.KafkaConsumingApp.-SNAPSHOT' was not found.
	at co.cask.cdap.internal.app.services.ApplicationLifecycleService.getAppDetail(ApplicationLifecycleService.java:249)
	at co.cask.cdap.gateway.handlers.AppLifecycleHttpHandler.getAppVersionInfo(AppLifecycleHttpHandler.java:271)
	at co.cask.cdap.internal.AppFabricClient.getVersionedInfo(AppFabricClient.java:577)
	at co.cask.cdap.test.internal.DefaultApplicationManager.stopAll(DefaultApplicationManager.java:127)
	at co.cask.cdap.test.TestBase.afterTest(TestBase.java:375)
	at sun.reflect.NativeMethodAccessorImpl.invoke0(Native Method)
	at sun.reflect.NativeMethodAccessorImpl.invoke(NativeMethodAccessorImpl.java:57)
(34 more lines...)
java.lang.RuntimeException: co.cask.cdap.common.ApplicationNotFoundException: 'application:default.KafkaConsumingApp.-SNAPSHOT' was not found.
	at co.cask.cdap.internal.app.services.ApplicationLifecycleService.getAppDetail(ApplicationLifecycleService.java:249)
	at co.cask.cdap.gateway.handlers.AppLifecycleHttpHandler.getAppVersionInfo(AppLifecycleHttpHandler.java:271)
	at co.cask.cdap.internal.AppFabricClient.getVersionedInfo(AppFabricClient.java:577)
	at co.cask.cdap.test.internal.DefaultApplicationManager.stopAll(DefaultApplicationManager.java:127)
	at co.cask.cdap.test.TestBase.afterTest(TestBase.java:375)
	at sun.reflect.NativeMethodAccessorImpl.invoke0(Native Method)
	at sun.reflect.NativeMethodAccessorImpl.invoke(NativeMethodAccessorImpl.java:57)
(34 more lines...)
java.lang.RuntimeException: co.cask.cdap.common.ApplicationNotFoundException: 'application:default.KafkaConsumingApp.-SNAPSHOT' was not found.
	at co.cask.cdap.internal.app.services.ApplicationLifecycleService.getAppDetail(ApplicationLifecycleService.java:249)
	at co.cask.cdap.gateway.handlers.AppLifecycleHttpHandler.getAppVersionInfo(AppLifecycleHttpHandler.java:271)
	at co.cask.cdap.internal.AppFabricClient.getVersionedInfo(AppFabricClient.java:577)
	at co.cask.cdap.test.internal.DefaultApplicationManager.stopAll(DefaultApplicationManager.java:127)
	at co.cask.cdap.test.TestBase.afterTest(TestBase.java:375)
	at sun.reflect.NativeMethodAccessorImpl.invoke0(Native Method)
	at sun.reflect.NativeMethodAccessorImpl.invoke(NativeMethodAccessorImpl.java:57)
(34 more lines...)
java.lang.RuntimeException: co.cask.cdap.common.ApplicationNotFoundException: 'application:default.KafkaConsumingApp.-SNAPSHOT' was not found.
	at co.cask.cdap.internal.app.services.ApplicationLifecycleService.getAppDetail(ApplicationLifecycleService.java:249)
	at co.cask.cdap.gateway.handlers.AppLifecycleHttpHandler.getAppVersionInfo(AppLifecycleHttpHandler.java:271)
	at co.cask.cdap.internal.AppFabricClient.getVersionedInfo(AppFabricClient.java:577)
	at co.cask.cdap.test.internal.DefaultApplicationManager.stopAll(DefaultApplicationManager.java:127)
	at co.cask.cdap.test.TestBase.afterTest(TestBase.java:375)
	at sun.reflect.NativeMethodAccessorImpl.invoke0(Native Method)
	at sun.reflect.NativeMethodAccessorImpl.invoke(NativeMethodAccessorImpl.java:57)
(34 more lines...)