Clusters with the click

Build: #325 failed

Job: Default Job failed

Stages & jobs

  1. Default Stage

Build log

The build generated 529 lines of output. Download or view full build log

14-May-2019 19:02:20 Build Coopr (old) - Develop Build and Test - Default Job #325 (COOP-DBT-JOB1-325) started building on agent bamboo-agent13.prod.continuuity.net
14-May-2019 19:02:20 Remote Agent
14-May-2019 19:02:20 Build working directory is /var/bamboo/xml-data/build-dir/COOP-DBT-JOB1
14-May-2019 19:02:20 Executing build Coopr (old) - Develop Build and Test - Default Job #325 (COOP-DBT-JOB1-325)
14-May-2019 19:02:20 Starting task 'Checkout Default Repository' of type 'com.atlassian.bamboo.plugins.vcs:task.vcs.checkout'
14-May-2019 19:02:20 Build always requires a clean checkout
14-May-2019 19:02:20 Cleaning build directory '/var/bamboo/xml-data/build-dir/COOP-DBT-JOB1'
14-May-2019 19:02:20 Checking out into /var/bamboo/xml-data/build-dir/COOP-DBT-JOB1
14-May-2019 19:02:20 Updating source code to revision: 9913e5e1954b5c6d02cb1f29f6395cef7320dc07
14-May-2019 19:02:20 Creating local git repository in '/var/bamboo/xml-data/build-dir/_git-repositories-cache/8ac15e8b6aee57048121885f3bc9f72109ce0ede/.git'.
14-May-2019 19:02:20 Initialized empty Git repository in /var/bamboo/xml-data/build-dir/_git-repositories-cache/8ac15e8b6aee57048121885f3bc9f72109ce0ede/.git/
14-May-2019 19:02:20 Fetching 'refs/heads/develop' from 'https://github.com/cdapio/coopr'.
14-May-2019 19:02:27 From https://github.com/cdapio/coopr
14-May-2019 19:02:27 * [new branch]      develop    -> develop
14-May-2019 19:02:27 * [new tag]         0.9.6      -> 0.9.6
14-May-2019 19:02:27 * [new tag]         0.9.7      -> 0.9.7
14-May-2019 19:02:27 * [new tag]         0.9.8      -> 0.9.8
14-May-2019 19:02:27 * [new tag]         0.9.9      -> 0.9.9
14-May-2019 19:02:27 Checking out revision 9913e5e1954b5c6d02cb1f29f6395cef7320dc07.
14-May-2019 19:02:27 Creating local git repository in '/var/bamboo/xml-data/build-dir/COOP-DBT-JOB1/.git'.
14-May-2019 19:02:27 Cloning into '/var/bamboo/xml-data/build-dir/COOP-DBT-JOB1'...
14-May-2019 19:02:27 done.
14-May-2019 19:02:29 Switched to a new branch 'develop'
14-May-2019 19:02:29 Branch develop set up to track remote branch develop from origin.
14-May-2019 19:02:29 Submodule 'coopr-provisioner' (https://github.com/cdapio/coopr-provisioner.git) registered for path 'coopr-provisioner'
14-May-2019 19:02:29 Submodule 'coopr-templates' (https://github.com/cdapio/coopr-templates.git) registered for path 'coopr-templates'
14-May-2019 19:02:29 Cloning into 'coopr-provisioner'...
14-May-2019 19:02:31 Submodule path 'coopr-provisioner': checked out 'cd7b28d4cd21ebb5756c1e2547c3945f47ec0958'
14-May-2019 19:02:31 Cloning into 'coopr-templates'...
14-May-2019 19:02:32 Submodule path 'coopr-templates': checked out '5cbe1046e0adac9b1796d2638f11043b4405e15e'
14-May-2019 19:02:32 Updated source code to revision: 9913e5e1954b5c6d02cb1f29f6395cef7320dc07
14-May-2019 19:02:32 Finished task 'Checkout Default Repository' with result: Success
14-May-2019 19:02:32 Running pre-build action: VCS Version Collector
14-May-2019 19:02:32 Starting task 'Build and Unit Test' of type 'com.atlassian.bamboo.plugins.maven:task.builder.mvn3'
14-May-2019 19:02:32
Beginning to execute external process for build 'Coopr (old) - Develop Build and Test - Default Job #325 (COOP-DBT-JOB1-325)'
... running command line:
/opt/maven/bin/mvn --batch-mode -Djava.io.tmpdir=/tmp/COOP-DBT-JOB1 clean test
... in: /var/bamboo/xml-data/build-dir/COOP-DBT-JOB1
... using extra environment variables:
bamboo_planRepository_1_branch=develop
bamboo_planRepository_1_branchDisplayName=develop
bamboo_repository_revision_number=9913e5e1954b5c6d02cb1f29f6395cef7320dc07
MAVEN2_HOME=/opt/maven
bamboo_repository_65208403_revision_number=9913e5e1954b5c6d02cb1f29f6395cef7320dc07
bamboo_capability_system_builder_command_s3cmd=/usr/bin/s3cmd
bamboo_docs_s3_bucket=docs.cask.co
bamboo_buildKey=COOP-DBT-JOB1
bamboo_repository_65208403_git_repositoryUrl=https://github.com/cdapio/coopr
bamboo_repository_65208403_branch_name=develop
bamboo_gpg_password=********
bamboo_ops_gpg_password=********
bamboo_shortJobName=Default Job
bamboo_buildResultsUrl=https://builds.cask.co/browse/COOP-DBT-JOB1-325
bamboo_capability_system_builder_mvn3_Maven_3_1=/opt/maven
bamboo_planRepository_repositoryUrl=https://github.com/cdapio/coopr
bamboo_repository_s3_bucket=repository.cask.co
bamboo_aws_secret_access_key_password=********
bamboo_agentId=32243730
bamboo_repository_65208403_git_branch=develop
bamboo_capability_Swapfile=true
bamboo_planRepository_revision=9913e5e1954b5c6d02cb1f29f6395cef7320dc07
bamboo_planRepository_previousRevision=cfa7c3d70aa84c6509cdafdc43544eca75ca2c88
bamboo_capability_RHEL=rhel
bamboo_capability_freight=true
bamboo_repository_branch_name=develop
bamboo_kdc_address_password=********
bamboo_capability_GPG=GPG
bamboo_capability_system_jdk_Oracle_JDK_8=/usr/lib/jvm/jdk8
JAVA_HOME=/usr/lib/jvm/jdk1.7.0_75
bamboo_capability_system_jdk_Oracle_JDK_7=/usr/lib/jvm/jdk7
bamboo_downloads_s3_bucket=downloads.cask.co
bamboo_planRepository_branch=develop
bamboo_market_s3_access_key_password=********
bamboo_planRepository_1_type=gitv2
bamboo_planRepository_branchName=develop
bamboo_capability_SPHINX=Sphinx
bamboo_capability_rsync=true
bamboo_market_cloudfront_secret_key_password=********
bamboo_capability_system_jdk_JDK=/usr/lib/jvm/jdk1.7.0_75
bamboo_hg_cache_directory=/var/bamboo/xml-data/build-dir/_hg-repositories-cache
bamboo_planRepository_1_username=
bamboo_planRepository_type=gitv2
bamboo_capability_expect=true
bamboo_git_cache_directory=/var/bamboo/xml-data/build-dir/_git-repositories-cache
bamboo_capability_RSYNC=rsync
useMavenReturnCode=true
bamboo_capability_system_builder_node_Node_js=/usr/bin/node
bamboo_capability_system_builder_mvn3_Maven_3=/opt/maven
bamboo_tmp_directory=/var/bamboo/temp
bamboo_planKey=COOP-DBT
bamboo_hide_jdk_mirror_password=********
bamboo_planRepository_username=
bamboo_capability_s3cmd=true
bamboo_planRepository_1_branchName=develop
bamboo_resultsUrl=https://builds.cask.co/browse/COOP-DBT-JOB1-325
bamboo_capability_Sphinx=true
bamboo_build_working_directory=/var/bamboo/xml-data/build-dir/COOP-DBT-JOB1
bamboo_planRepository_1_name=cdapio/coopr
bamboo_repository_65208403_name=cdapio/coopr
bamboo_shortPlanName=Develop Build and Test
bamboo_planRepository_name=cdapio/coopr
bamboo_capability_git_lfs=true
bamboo_buildNumber=325
bamboo_planName=Coopr (old) - Develop Build and Test
bamboo_shortPlanKey=DBT
bamboo_shortJobKey=JOB1
bamboo_buildTimeStamp=2019-05-14T19:02:20.095Z
bamboo_repository_previous_revision_number=cfa7c3d70aa84c6509cdafdc43544eca75ca2c88
bamboo_repository_65208403_previous_revision_number=cfa7c3d70aa84c6509cdafdc43544eca75ca2c88
M2_HOME=/opt/maven
bamboo_s3_bucket=repository.cask.co
bamboo_capability_system_builder_command_Docker=/usr/bin/docker
bamboo_repository_git_branch=develop
bamboo_buildResultKey=COOP-DBT-JOB1-325
bamboo_market_s3_secret_key_password=********
bamboo_buildPlanName=Coopr (old) - Develop Build and Test - Default Job
bamboo_capability_system_jdk_JDK_1_8_0_101=/usr/lib/jvm/jdk1.8.0_101
bamboo_capability_system_builder_command_fpm=/opt/rbenv/shims/fpm
bamboo_capability_Platform=rhel
bamboo_planRepository_1_revision=9913e5e1954b5c6d02cb1f29f6395cef7320dc07
bamboo_repository_name=cdapio/coopr
bamboo_repository_65208403_git_username=
bamboo_buildFailed=false
bamboo_capability_system_docker_executable=/usr/bin/docker
bamboo_agentWorkingDirectory=/var/bamboo/xml-data/build-dir
bamboo_capability_system_git_executable=/usr/local/bin/git
bamboo_repository_git_username=
bamboo_planRepository_1_previousRevision=cfa7c3d70aa84c6509cdafdc43544eca75ca2c88
bamboo_capability_system_builder_command_Ruby=/opt/rbenv/shims/ruby
bamboo_planRepository_branchDisplayName=develop
bamboo_aws_access_key_password=********
bamboo_capability_system_builder_mvn3_Maven_3_x=/opt/maven
bamboo_plan_storageTag=COOP-DBT
bamboo_repository_git_repositoryUrl=https://github.com/cdapio/coopr
bamboo_market_cloudfront_access_key_password=********
bamboo_working_directory=/var/bamboo/xml-data/build-dir/COOP-DBT-JOB1
bamboo_planRepository_1_repositoryUrl=https://github.com/cdapio/coopr
bamboo_capability_createrepo=true
bamboo_capability_system_jdk_JDK_1_8=/usr/lib/jvm/jdk1.8.0_101
bamboo_capability_rpm_build=true
bamboo_capability_system_jdk_JDK_1_7=/usr/lib/jvm/jdk1.7.0_75
PATH=/usr/lib/jvm/jdk1.7.0_75/bin:/usr/lib/jvm/java/bin:/opt/rbenv/shims:/opt/rbenv/bin:/opt/rbenv/plugins/ruby_build/bin:/usr/local/maven-3.1.1/bin:/usr/local/bin:/bin:/usr/bin:/usr/local/sbin:/usr/sbin:/sbin:/home/bamboo/bin
14-May-2019 19:02:34 [INFO] Scanning for projects...
14-May-2019 19:02:34 [INFO] ------------------------------------------------------------------------
14-May-2019 19:02:34 [INFO] Reactor Build Order:
14-May-2019 19:02:34 [INFO]
14-May-2019 19:02:34 [INFO] Cask Coopr
14-May-2019 19:02:34 [INFO] Coopr Server
14-May-2019 19:02:34 [INFO] Coopr REST Client API
14-May-2019 19:02:34 [INFO] Coopr CLI
14-May-2019 19:02:34 [INFO] Coopr UI
14-May-2019 19:02:34 [INFO]                                                                         
14-May-2019 19:02:34 [INFO] ------------------------------------------------------------------------
14-May-2019 19:02:34 [INFO] Building Cask Coopr 0.9.10-SNAPSHOT
14-May-2019 19:02:34 [INFO] ------------------------------------------------------------------------
14-May-2019 19:02:34 [INFO] Downloading: http://repo.maven.apache.org/maven2/org/apache/maven/plugins/maven-jar-plugin/2.2/maven-jar-plugin-2.2.pom
14-May-2019 19:02:34 [INFO] Downloaded: http://repo.maven.apache.org/maven2/org/apache/maven/plugins/maven-jar-plugin/2.2/maven-jar-plugin-2.2.pom (9 KB at 40.4 KB/sec)
14-May-2019 19:02:34 [INFO] Downloading: http://repo.maven.apache.org/maven2/org/apache/maven/plugins/maven-plugins/10/maven-plugins-10.pom
14-May-2019 19:02:35 [INFO] Downloaded: http://repo.maven.apache.org/maven2/org/apache/maven/plugins/maven-plugins/10/maven-plugins-10.pom (8 KB at 250.9 KB/sec)
14-May-2019 19:02:35 [INFO] Downloading: http://repo.maven.apache.org/maven2/org/apache/maven/plugins/maven-jar-plugin/2.2/maven-jar-plugin-2.2.jar
14-May-2019 19:02:35 [INFO] Downloaded: http://repo.maven.apache.org/maven2/org/apache/maven/plugins/maven-jar-plugin/2.2/maven-jar-plugin-2.2.jar (27 KB at 667.2 KB/sec)
14-May-2019 19:02:35 [INFO]
14-May-2019 19:02:35 [INFO] --- maven-clean-plugin:2.5:clean (default-clean) @ coopr-parent ---
14-May-2019 19:02:35 [INFO]                                                                         
14-May-2019 19:02:35 [INFO] ------------------------------------------------------------------------
14-May-2019 19:02:35 [INFO] Building Coopr Server 0.9.10-SNAPSHOT
14-May-2019 19:02:35 [INFO] ------------------------------------------------------------------------
14-May-2019 19:02:35 [INFO] Downloading: https://oss.sonatype.org/content/repositories/snapshots/co/cask/http/netty-http/0.8.0/netty-http-0.8.0.pom
14-May-2019 19:02:35 [INFO] Downloading: http://repo.maven.apache.org/maven2/co/cask/http/netty-http/0.8.0/netty-http-0.8.0.pom
14-May-2019 19:02:35 [INFO] Downloaded: http://repo.maven.apache.org/maven2/co/cask/http/netty-http/0.8.0/netty-http-0.8.0.pom (16 KB at 60.8 KB/sec)
14-May-2019 19:02:36 [INFO] Downloading: https://oss.sonatype.org/content/repositories/snapshots/org/apache/tomcat/tomcat-jdbc/7.0.50/tomcat-jdbc-7.0.50.pom
14-May-2019 19:02:36 [INFO] Downloading: http://repo.maven.apache.org/maven2/org/apache/tomcat/tomcat-jdbc/7.0.50/tomcat-jdbc-7.0.50.pom
14-May-2019 19:02:36 [INFO] Downloaded: http://repo.maven.apache.org/maven2/org/apache/tomcat/tomcat-jdbc/7.0.50/tomcat-jdbc-7.0.50.pom (2 KB at 52.1 KB/sec)
14-May-2019 19:02:36 [INFO] Downloading: https://oss.sonatype.org/content/repositories/snapshots/org/apache/tomcat/tomcat-juli/7.0.50/tomcat-juli-7.0.50.pom
14-May-2019 19:02:36 [INFO] Downloading: http://repo.maven.apache.org/maven2/org/apache/tomcat/tomcat-juli/7.0.50/tomcat-juli-7.0.50.pom
14-May-2019 19:02:36 [INFO] Downloaded: http://repo.maven.apache.org/maven2/org/apache/tomcat/tomcat-juli/7.0.50/tomcat-juli-7.0.50.pom (2 KB at 44.7 KB/sec)
14-May-2019 19:02:36 [INFO] Downloading: https://oss.sonatype.org/content/repositories/snapshots/net/spy/spymemcached/2.10.6/spymemcached-2.10.6.pom
14-May-2019 19:02:37 [INFO] Downloading: http://repo.maven.apache.org/maven2/net/spy/spymemcached/2.10.6/spymemcached-2.10.6.pom
14-May-2019 19:02:37 [INFO] Downloaded: http://repo.maven.apache.org/maven2/net/spy/spymemcached/2.10.6/spymemcached-2.10.6.pom (2 KB at 40.4 KB/sec)
14-May-2019 19:02:37 [INFO] Downloading: https://oss.sonatype.org/content/repositories/snapshots/co/cask/cdap/cdap-security/2.6.0/cdap-security-2.6.0.pom
14-May-2019 19:02:37 [INFO] Downloading: http://repo.maven.apache.org/maven2/co/cask/cdap/cdap-security/2.6.0/cdap-security-2.6.0.pom
14-May-2019 19:02:37 [INFO] Downloaded: http://repo.maven.apache.org/maven2/co/cask/cdap/cdap-security/2.6.0/cdap-security-2.6.0.pom (10 KB at 45.9 KB/sec)
14-May-2019 19:02:37 [INFO] Downloading: https://oss.sonatype.org/content/repositories/snapshots/co/cask/cdap/cdap/2.6.0/cdap-2.6.0.pom
14-May-2019 19:02:37 [INFO] Downloading: http://repo.maven.apache.org/maven2/co/cask/cdap/cdap/2.6.0/cdap-2.6.0.pom
14-May-2019 19:02:38 [INFO] Downloaded: http://repo.maven.apache.org/maven2/co/cask/cdap/cdap/2.6.0/cdap-2.6.0.pom (77 KB at 339.9 KB/sec)
14-May-2019 19:02:38 [INFO] Downloading: https://oss.sonatype.org/content/repositories/snapshots/co/cask/cdap/cdap-common/2.6.0/cdap-common-2.6.0.pom
14-May-2019 19:02:38 [INFO] Downloading: http://repo.maven.apache.org/maven2/co/cask/cdap/cdap-common/2.6.0/cdap-common-2.6.0.pom
14-May-2019 19:02:38 [INFO] Downloaded: http://repo.maven.apache.org/maven2/co/cask/cdap/cdap-common/2.6.0/cdap-common-2.6.0.pom (6 KB at 43.5 KB/sec)
14-May-2019 19:02:38 [INFO] Downloading: https://oss.sonatype.org/content/repositories/snapshots/co/cask/cdap/cdap-api/2.6.0/cdap-api-2.6.0.pom
14-May-2019 19:02:38 [INFO] Downloading: http://repo.maven.apache.org/maven2/co/cask/cdap/cdap-api/2.6.0/cdap-api-2.6.0.pom
14-May-2019 19:02:38 [INFO] Downloaded: http://repo.maven.apache.org/maven2/co/cask/cdap/cdap-api/2.6.0/cdap-api-2.6.0.pom (2 KB at 13.0 KB/sec)
14-May-2019 19:02:38 [INFO] Downloading: https://oss.sonatype.org/content/repositories/snapshots/co/cask/tephra/tephra-api/0.3.4/tephra-api-0.3.4.pom
14-May-2019 19:02:39 [INFO] Downloading: http://repo.maven.apache.org/maven2/co/cask/tephra/tephra-api/0.3.4/tephra-api-0.3.4.pom
14-May-2019 19:02:39 [INFO] Downloaded: http://repo.maven.apache.org/maven2/co/cask/tephra/tephra-api/0.3.4/tephra-api-0.3.4.pom (2 KB at 5.2 KB/sec)
14-May-2019 19:02:39 [INFO] Downloading: https://oss.sonatype.org/content/repositories/snapshots/co/cask/tephra/tephra/0.3.4/tephra-0.3.4.pom
14-May-2019 19:02:39 [INFO] Downloading: http://repo.maven.apache.org/maven2/co/cask/tephra/tephra/0.3.4/tephra-0.3.4.pom
14-May-2019 19:02:39 [INFO] Downloaded: http://repo.maven.apache.org/maven2/co/cask/tephra/tephra/0.3.4/tephra-0.3.4.pom (19 KB at 244.7 KB/sec)
14-May-2019 19:02:40 [INFO] Downloading: https://oss.sonatype.org/content/repositories/snapshots/co/cask/cdap/cdap-proto/2.6.0/cdap-proto-2.6.0.pom
14-May-2019 19:02:40 [INFO] Downloading: http://repo.maven.apache.org/maven2/co/cask/cdap/cdap-proto/2.6.0/cdap-proto-2.6.0.pom
14-May-2019 19:02:40 [INFO] Downloaded: http://repo.maven.apache.org/maven2/co/cask/cdap/cdap-proto/2.6.0/cdap-proto-2.6.0.pom (2 KB at 9.3 KB/sec)
14-May-2019 19:02:43 [INFO] Downloading: https://oss.sonatype.org/content/repositories/snapshots/org/apache/twill/twill-yarn/0.4.0-incubating/twill-yarn-0.4.0-incubating.pom
14-May-2019 19:02:43 [INFO] Downloading: http://repo.maven.apache.org/maven2/org/apache/twill/twill-yarn/0.4.0-incubating/twill-yarn-0.4.0-incubating.pom
14-May-2019 19:02:44 [INFO] Downloaded: http://repo.maven.apache.org/maven2/org/apache/twill/twill-yarn/0.4.0-incubating/twill-yarn-0.4.0-incubating.pom (6 KB at 65.6 KB/sec)
14-May-2019 19:02:44 [INFO] Downloading: https://oss.sonatype.org/content/repositories/snapshots/org/apache/twill/twill-zookeeper/0.2.0-incubating/twill-zookeeper-0.2.0-incubating.pom
14-May-2019 19:02:44 [INFO] Downloading: http://repo.maven.apache.org/maven2/org/apache/twill/twill-zookeeper/0.2.0-incubating/twill-zookeeper-0.2.0-incubating.pom
14-May-2019 19:02:45 [INFO] Downloaded: http://repo.maven.apache.org/maven2/org/apache/twill/twill-zookeeper/0.2.0-incubating/twill-zookeeper-0.2.0-incubating.pom (3 KB at 13.2 KB/sec)
14-May-2019 19:02:45 [INFO] Downloading: https://oss.sonatype.org/content/repositories/snapshots/org/apache/twill/twill-parent/0.2.0-incubating/twill-parent-0.2.0-incubating.pom
14-May-2019 19:02:45 [INFO] Downloading: http://repo.maven.apache.org/maven2/org/apache/twill/twill-parent/0.2.0-incubating/twill-parent-0.2.0-incubating.pom
14-May-2019 19:02:45 [INFO] Downloaded: http://repo.maven.apache.org/maven2/org/apache/twill/twill-parent/0.2.0-incubating/twill-parent-0.2.0-incubating.pom (37 KB at 483.6 KB/sec)
14-May-2019 19:02:45 [INFO] Downloading: https://oss.sonatype.org/content/repositories/snapshots/org/apache/twill/twill-common/0.2.0-incubating/twill-common-0.2.0-incubating.pom
14-May-2019 19:02:45 [INFO] Downloading: http://repo.maven.apache.org/maven2/org/apache/twill/twill-common/0.2.0-incubating/twill-common-0.2.0-incubating.pom
14-May-2019 19:02:45 [INFO] Downloaded: http://repo.maven.apache.org/maven2/org/apache/twill/twill-common/0.2.0-incubating/twill-common-0.2.0-incubating.pom (2 KB at 12.3 KB/sec)
14-May-2019 19:02:45 [INFO] Downloading: https://oss.sonatype.org/content/repositories/snapshots/org/apache/commons/commons-lang3/3.3/commons-lang3-3.3.pom
14-May-2019 19:02:45 [INFO] Downloading: http://repo.maven.apache.org/maven2/org/apache/commons/commons-lang3/3.3/commons-lang3-3.3.pom
14-May-2019 19:02:45 [INFO] Downloaded: http://repo.maven.apache.org/maven2/org/apache/commons/commons-lang3/3.3/commons-lang3-3.3.pom (20 KB at 642.4 KB/sec)
14-May-2019 19:02:45 [INFO] Downloading: https://oss.sonatype.org/content/repositories/snapshots/org/apache/httpcomponents/httpclient/4.3.3/httpclient-4.3.3.pom
14-May-2019 19:02:45 [INFO] Downloading: http://repo.maven.apache.org/maven2/org/apache/httpcomponents/httpclient/4.3.3/httpclient-4.3.3.pom
14-May-2019 19:02:46 [INFO] Downloaded: http://repo.maven.apache.org/maven2/org/apache/httpcomponents/httpclient/4.3.3/httpclient-4.3.3.pom (6 KB at 180.9 KB/sec)
14-May-2019 19:02:46 [INFO] Downloading: https://oss.sonatype.org/content/repositories/snapshots/org/apache/httpcomponents/httpcomponents-client/4.3.3/httpcomponents-client-4.3.3.pom
14-May-2019 19:02:46 [INFO] Downloading: http://repo.maven.apache.org/maven2/org/apache/httpcomponents/httpcomponents-client/4.3.3/httpcomponents-client-4.3.3.pom
14-May-2019 19:02:46 [INFO] Downloaded: http://repo.maven.apache.org/maven2/org/apache/httpcomponents/httpcomponents-client/4.3.3/httpcomponents-client-4.3.3.pom (16 KB at 515.9 KB/sec)
14-May-2019 19:02:46 [INFO] Downloading: https://oss.sonatype.org/content/repositories/snapshots/org/apache/httpcomponents/httpcore/4.3.2/httpcore-4.3.2.pom
14-May-2019 19:02:46 [INFO] Downloading: http://repo.maven.apache.org/maven2/org/apache/httpcomponents/httpcore/4.3.2/httpcore-4.3.2.pom
14-May-2019 19:02:46 [INFO] Downloaded: http://repo.maven.apache.org/maven2/org/apache/httpcomponents/httpcore/4.3.2/httpcore-4.3.2.pom (0 B at 0.0 KB/sec)
14-May-2019 19:02:46 [INFO] Downloading: http://files.couchbase.com/maven2/org/apache/httpcomponents/httpcore/4.3.2/httpcore-4.3.2.pom
14-May-2019 19:02:47 [INFO] Downloading: https://oss.sonatype.org/content/repositories/snapshots/org/apache/httpcomponents/httpcomponents-core/4.3.2/httpcomponents-core-4.3.2.pom
14-May-2019 19:02:47 [INFO] Downloading: http://repo.maven.apache.org/maven2/org/apache/httpcomponents/httpcomponents-core/4.3.2/httpcomponents-core-4.3.2.pom
14-May-2019 19:02:47 [INFO] Downloaded: http://repo.maven.apache.org/maven2/org/apache/httpcomponents/httpcomponents-core/4.3.2/httpcomponents-core-4.3.2.pom (0 B at 0.0 KB/sec)
14-May-2019 19:02:47 [INFO] Downloading: http://files.couchbase.com/maven2/org/apache/httpcomponents/httpcomponents-core/4.3.2/httpcomponents-core-4.3.2.pom
14-May-2019 19:02:47 [INFO] Downloading: https://oss.sonatype.org/content/repositories/snapshots/co/cask/cdap/cdap-authentication-client/1.1.0/cdap-authentication-client-1.1.0.pom
14-May-2019 19:02:47 [INFO] Downloading: http://repo.maven.apache.org/maven2/co/cask/cdap/cdap-authentication-client/1.1.0/cdap-authentication-client-1.1.0.pom
14-May-2019 19:02:47 [INFO] Downloaded: http://repo.maven.apache.org/maven2/co/cask/cdap/cdap-authentication-client/1.1.0/cdap-authentication-client-1.1.0.pom (3 KB at 15.6 KB/sec)
14-May-2019 19:02:47 [INFO] Downloading: https://oss.sonatype.org/content/repositories/snapshots/co/cask/cdap/cdap-authentication-clients/1.1.0/cdap-authentication-clients-1.1.0.pom
14-May-2019 19:02:47 [INFO] Downloading: http://repo.maven.apache.org/maven2/co/cask/cdap/cdap-authentication-clients/1.1.0/cdap-authentication-clients-1.1.0.pom
14-May-2019 19:02:47 [INFO] Downloaded: http://repo.maven.apache.org/maven2/co/cask/cdap/cdap-authentication-clients/1.1.0/cdap-authentication-clients-1.1.0.pom (5 KB at 32.8 KB/sec)
14-May-2019 19:02:47 [INFO] Downloading: https://oss.sonatype.org/content/repositories/snapshots/co/cask/cdap/cdap-clients/1.1.0/cdap-clients-1.1.0.pom
14-May-2019 19:02:48 [INFO] Downloading: http://repo.maven.apache.org/maven2/co/cask/cdap/cdap-clients/1.1.0/cdap-clients-1.1.0.pom
14-May-2019 19:02:48 [INFO] Downloaded: http://repo.maven.apache.org/maven2/co/cask/cdap/cdap-clients/1.1.0/cdap-clients-1.1.0.pom (15 KB at 89.9 KB/sec)
14-May-2019 19:02:48 [INFO] Downloading: https://oss.sonatype.org/content/repositories/snapshots/org/mockito/mockito-all/1.9.5/mockito-all-1.9.5.pom
14-May-2019 19:02:48 [INFO] Downloading: http://repo.maven.apache.org/maven2/org/mockito/mockito-all/1.9.5/mockito-all-1.9.5.pom
14-May-2019 19:02:48 [INFO] Downloaded: http://repo.maven.apache.org/maven2/org/mockito/mockito-all/1.9.5/mockito-all-1.9.5.pom (2 KB at 36.3 KB/sec)
14-May-2019 19:02:48 [INFO] Downloading: https://oss.sonatype.org/content/repositories/snapshots/co/cask/http/netty-http/0.8.0/netty-http-0.8.0.jar
14-May-2019 19:02:48 [INFO] Downloading: https://oss.sonatype.org/content/repositories/snapshots/org/apache/derby/derby/10.10.1.1/derby-10.10.1.1.jar
14-May-2019 19:02:48 [INFO] Downloading: https://oss.sonatype.org/content/repositories/snapshots/org/apache/tomcat/tomcat-jdbc/7.0.50/tomcat-jdbc-7.0.50.jar
14-May-2019 19:02:48 [INFO] Downloading: https://oss.sonatype.org/content/repositories/snapshots/net/spy/spymemcached/2.10.6/spymemcached-2.10.6.jar
14-May-2019 19:02:48 [INFO] Downloading: https://oss.sonatype.org/content/repositories/snapshots/org/apache/tomcat/tomcat-juli/7.0.50/tomcat-juli-7.0.50.jar
14-May-2019 19:02:48 [INFO] Downloading: https://oss.sonatype.org/content/repositories/snapshots/co/cask/cdap/cdap-security/2.6.0/cdap-security-2.6.0.jar
14-May-2019 19:02:48 [INFO] Downloading: https://oss.sonatype.org/content/repositories/snapshots/co/cask/cdap/cdap-common/2.6.0/cdap-common-2.6.0.jar
14-May-2019 19:02:48 [INFO] Downloading: https://oss.sonatype.org/content/repositories/snapshots/co/cask/cdap/cdap-api/2.6.0/cdap-api-2.6.0.jar
14-May-2019 19:02:48 [INFO] Downloading: https://oss.sonatype.org/content/repositories/snapshots/co/cask/tephra/tephra-api/0.3.4/tephra-api-0.3.4.jar
14-May-2019 19:02:48 [INFO] Downloading: https://oss.sonatype.org/content/repositories/snapshots/org/apache/twill/twill-yarn/0.4.0-incubating/twill-yarn-0.4.0-incubating.jar
14-May-2019 19:02:49 [INFO] Downloading: https://oss.sonatype.org/content/repositories/snapshots/org/apache/twill/twill-core/0.4.0-incubating/twill-core-0.4.0-incubating.jar
14-May-2019 19:02:49 [INFO] Downloading: https://oss.sonatype.org/content/repositories/snapshots/org/scala-lang/scala-compiler/2.10.1/scala-compiler-2.10.1.jar
14-May-2019 19:02:49 [INFO] Downloading: https://oss.sonatype.org/content/repositories/snapshots/org/scala-lang/scala-reflect/2.10.1/scala-reflect-2.10.1.jar
14-May-2019 19:02:49 [INFO] Downloading: https://oss.sonatype.org/content/repositories/snapshots/co/cask/cdap/cdap-proto/2.6.0/cdap-proto-2.6.0.jar
14-May-2019 19:02:49 [INFO] Downloading: https://oss.sonatype.org/content/repositories/snapshots/org/apache/twill/twill-zookeeper/0.2.0-incubating/twill-zookeeper-0.2.0-incubating.jar
14-May-2019 19:02:49 [INFO] Downloading: https://oss.sonatype.org/content/repositories/snapshots/org/apache/twill/twill-common/0.2.0-incubating/twill-common-0.2.0-incubating.jar
14-May-2019 19:02:49 [INFO] Downloading: https://oss.sonatype.org/content/repositories/snapshots/org/apache/commons/commons-lang3/3.3/commons-lang3-3.3.jar
14-May-2019 19:02:49 [INFO] Downloading: https://oss.sonatype.org/content/repositories/snapshots/org/apache/httpcomponents/httpclient/4.3.3/httpclient-4.3.3.jar
14-May-2019 19:02:49 [INFO] Downloading: https://oss.sonatype.org/content/repositories/snapshots/org/apache/httpcomponents/httpcore/4.3.2/httpcore-4.3.2.jar
14-May-2019 19:02:49 [INFO] Downloading: https://oss.sonatype.org/content/repositories/snapshots/co/cask/cdap/cdap-authentication-client/1.1.0/cdap-authentication-client-1.1.0.jar
14-May-2019 19:02:49 [INFO] Downloading: https://oss.sonatype.org/content/repositories/snapshots/org/mockito/mockito-all/1.9.5/mockito-all-1.9.5.jar
14-May-2019 19:02:49 [INFO] Downloading: http://repo.maven.apache.org/maven2/co/cask/http/netty-http/0.8.0/netty-http-0.8.0.jar
14-May-2019 19:02:49 [INFO] Downloading: http://repo.maven.apache.org/maven2/org/apache/derby/derby/10.10.1.1/derby-10.10.1.1.jar
14-May-2019 19:02:49 [INFO] Downloading: http://repo.maven.apache.org/maven2/org/apache/tomcat/tomcat-jdbc/7.0.50/tomcat-jdbc-7.0.50.jar
14-May-2019 19:02:49 [INFO] Downloading: http://repo.maven.apache.org/maven2/org/apache/tomcat/tomcat-juli/7.0.50/tomcat-juli-7.0.50.jar
14-May-2019 19:02:49 [INFO] Downloading: http://repo.maven.apache.org/maven2/net/spy/spymemcached/2.10.6/spymemcached-2.10.6.jar
14-May-2019 19:02:49 [INFO] Downloaded: http://repo.maven.apache.org/maven2/org/apache/tomcat/tomcat-juli/7.0.50/tomcat-juli-7.0.50.jar (38 KB at 662.7 KB/sec)
14-May-2019 19:02:49 [INFO] Downloading: http://repo.maven.apache.org/maven2/co/cask/cdap/cdap-security/2.6.0/cdap-security-2.6.0.jar
14-May-2019 19:02:49 [INFO] Downloaded: http://repo.maven.apache.org/maven2/org/apache/tomcat/tomcat-jdbc/7.0.50/tomcat-jdbc-7.0.50.jar (123 KB at 1570.7 KB/sec)
14-May-2019 19:02:49 [INFO] Downloading: http://repo.maven.apache.org/maven2/co/cask/cdap/cdap-common/2.6.0/cdap-common-2.6.0.jar
14-May-2019 19:02:49 [INFO] Downloaded: http://repo.maven.apache.org/maven2/net/spy/spymemcached/2.10.6/spymemcached-2.10.6.jar (440 KB at 2175.4 KB/sec)
14-May-2019 19:02:49 [INFO] Downloading: http://repo.maven.apache.org/maven2/co/cask/cdap/cdap-api/2.6.0/cdap-api-2.6.0.jar
14-May-2019 19:02:49 [INFO] Downloaded: http://repo.maven.apache.org/maven2/co/cask/http/netty-http/0.8.0/netty-http-0.8.0.jar (69 KB at 311.1 KB/sec)
14-May-2019 19:02:49 [INFO] Downloading: http://repo.maven.apache.org/maven2/co/cask/tephra/tephra-api/0.3.4/tephra-api-0.3.4.jar
14-May-2019 19:02:49 [INFO] Downloaded: http://repo.maven.apache.org/maven2/org/apache/derby/derby/10.10.1.1/derby-10.10.1.1.jar (2765 KB at 10317.2 KB/sec)
14-May-2019 19:02:49 [INFO] Downloading: http://repo.maven.apache.org/maven2/org/apache/twill/twill-yarn/0.4.0-incubating/twill-yarn-0.4.0-incubating.jar
14-May-2019 19:02:49 [INFO] Downloaded: http://repo.maven.apache.org/maven2/co/cask/cdap/cdap-security/2.6.0/cdap-security-2.6.0.jar (114 KB at 492.8 KB/sec)
14-May-2019 19:02:49 [INFO] Downloading: http://repo.maven.apache.org/maven2/org/apache/twill/twill-core/0.4.0-incubating/twill-core-0.4.0-incubating.jar
14-May-2019 19:02:49 [INFO] Downloaded: http://repo.maven.apache.org/maven2/org/apache/twill/twill-core/0.4.0-incubating/twill-core-0.4.0-incubating.jar (242 KB at 2304.1 KB/sec)
14-May-2019 19:02:49 [INFO] Downloading: http://repo.maven.apache.org/maven2/org/scala-lang/scala-compiler/2.10.1/scala-compiler-2.10.1.jar
14-May-2019 19:02:49 [INFO] Downloaded: http://repo.maven.apache.org/maven2/co/cask/cdap/cdap-api/2.6.0/cdap-api-2.6.0.jar (275 KB at 1437.5 KB/sec)
14-May-2019 19:02:49 [INFO] Downloading: http://repo.maven.apache.org/maven2/org/scala-lang/scala-reflect/2.10.1/scala-reflect-2.10.1.jar
14-May-2019 19:02:49 [INFO] Downloaded: http://repo.maven.apache.org/maven2/co/cask/tephra/tephra-api/0.3.4/tephra-api-0.3.4.jar (7 KB at 35.7 KB/sec)
14-May-2019 19:02:49 [INFO] Downloading: http://repo.maven.apache.org/maven2/co/cask/cdap/cdap-proto/2.6.0/cdap-proto-2.6.0.jar
14-May-2019 19:02:49 [INFO] Downloaded: http://repo.maven.apache.org/maven2/co/cask/cdap/cdap-common/2.6.0/cdap-common-2.6.0.jar (432 KB at 1304.8 KB/sec)
14-May-2019 19:02:49 [INFO] Downloading: http://repo.maven.apache.org/maven2/org/apache/twill/twill-zookeeper/0.2.0-incubating/twill-zookeeper-0.2.0-incubating.jar
14-May-2019 19:02:49 [INFO] Downloaded: http://repo.maven.apache.org/maven2/org/apache/twill/twill-yarn/0.4.0-incubating/twill-yarn-0.4.0-incubating.jar (218 KB at 1316.3 KB/sec)
14-May-2019 19:02:49 [INFO] Downloading: http://repo.maven.apache.org/maven2/org/apache/twill/twill-common/0.2.0-incubating/twill-common-0.2.0-incubating.jar
14-May-2019 19:02:50 [INFO] Downloaded: http://repo.maven.apache.org/maven2/org/apache/twill/twill-zookeeper/0.2.0-incubating/twill-zookeeper-0.2.0-incubating.jar (101 KB at 1354.9 KB/sec)
14-May-2019 19:02:50 [INFO] Downloading: http://repo.maven.apache.org/maven2/org/apache/commons/commons-lang3/3.3/commons-lang3-3.3.jar
14-May-2019 19:02:50 [INFO] Downloaded: http://repo.maven.apache.org/maven2/org/apache/twill/twill-common/0.2.0-incubating/twill-common-0.2.0-incubating.jar (19 KB at 234.3 KB/sec)
14-May-2019 19:02:50 [INFO] Downloading: http://repo.maven.apache.org/maven2/org/apache/httpcomponents/httpclient/4.3.3/httpclient-4.3.3.jar
14-May-2019 19:02:50 [INFO] Downloaded: http://repo.maven.apache.org/maven2/org/apache/commons/commons-lang3/3.3/commons-lang3-3.3.jar (403 KB at 7901.4 KB/sec)
14-May-2019 19:02:50 [INFO] Downloading: http://repo.maven.apache.org/maven2/org/apache/httpcomponents/httpcore/4.3.2/httpcore-4.3.2.jar
14-May-2019 19:02:50 [INFO] Downloaded: http://repo.maven.apache.org/maven2/org/apache/httpcomponents/httpcore/4.3.2/httpcore-4.3.2.jar (0 B at 0.0 KB/sec)
14-May-2019 19:02:50 [INFO] Downloading: http://repo.maven.apache.org/maven2/co/cask/cdap/cdap-authentication-client/1.1.0/cdap-authentication-client-1.1.0.jar
14-May-2019 19:02:50 [INFO] Downloaded: http://repo.maven.apache.org/maven2/co/cask/cdap/cdap-proto/2.6.0/cdap-proto-2.6.0.jar (36 KB at 221.6 KB/sec)
14-May-2019 19:02:50 [INFO] Downloading: http://repo.maven.apache.org/maven2/org/mockito/mockito-all/1.9.5/mockito-all-1.9.5.jar
14-May-2019 19:02:50 [INFO] Downloaded: http://repo.maven.apache.org/maven2/org/apache/httpcomponents/httpclient/4.3.3/httpclient-4.3.3.jar (576 KB at 11513.9 KB/sec)
14-May-2019 19:02:50 [INFO] Downloaded: http://repo.maven.apache.org/maven2/org/scala-lang/scala-reflect/2.10.1/scala-reflect-2.10.1.jar (3105 KB at 14045.4 KB/sec)
14-May-2019 19:02:50 [INFO] Downloaded: http://repo.maven.apache.org/maven2/org/mockito/mockito-all/1.9.5/mockito-all-1.9.5.jar (1545 KB at 12760.4 KB/sec)
14-May-2019 19:02:50 [INFO] Downloaded: http://repo.maven.apache.org/maven2/co/cask/cdap/cdap-authentication-client/1.1.0/cdap-authentication-client-1.1.0.jar (12 KB at 66.4 KB/sec)
14-May-2019 19:02:50 [INFO] Downloaded: http://repo.maven.apache.org/maven2/org/scala-lang/scala-compiler/2.10.1/scala-compiler-2.10.1.jar (14047 KB at 17803.5 KB/sec)
14-May-2019 19:02:50 [INFO] Downloading: http://files.couchbase.com/maven2/org/apache/httpcomponents/httpcore/4.3.2/httpcore-4.3.2.jar
14-May-2019 19:02:50 [INFO]
14-May-2019 19:02:50 [INFO] --- maven-clean-plugin:2.5:clean (default-clean) @ coopr ---
14-May-2019 19:02:50 [INFO]
14-May-2019 19:02:50 [INFO] --- maven-resources-plugin:2.6:resources (default-resources) @ coopr ---
14-May-2019 19:02:50 [INFO] Using 'UTF-8' encoding to copy filtered resources.
14-May-2019 19:02:50 [INFO] Copying 3 resources
14-May-2019 19:02:50 [INFO]
14-May-2019 19:02:50 [INFO] --- maven-compiler-plugin:3.1:compile (default-compile) @ coopr ---
14-May-2019 19:02:51 [INFO] Changes detected - recompiling the module!
14-May-2019 19:02:51 [INFO] Compiling 352 source files to /var/bamboo/xml-data/build-dir/COOP-DBT-JOB1/coopr-server/target/classes
14-May-2019 19:03:00 [WARNING] /var/bamboo/xml-data/build-dir/COOP-DBT-JOB1/coopr-server/src/main/java/co/cask/coopr/http/handler/AbstractAuthHandler.java: Some input files use or override a deprecated API.
14-May-2019 19:03:00 [WARNING] /var/bamboo/xml-data/build-dir/COOP-DBT-JOB1/coopr-server/src/main/java/co/cask/coopr/http/handler/AbstractAuthHandler.java: Recompile with -Xlint:deprecation for details.
14-May-2019 19:03:00 [WARNING] /var/bamboo/xml-data/build-dir/COOP-DBT-JOB1/coopr-server/src/main/java/co/cask/coopr/spec/plugin/AbstractPluginSpecification.java: Some input files use unchecked or unsafe operations.
14-May-2019 19:03:00 [WARNING] /var/bamboo/xml-data/build-dir/COOP-DBT-JOB1/coopr-server/src/main/java/co/cask/coopr/spec/plugin/AbstractPluginSpecification.java: Recompile with -Xlint:unchecked for details.
14-May-2019 19:03:00 [INFO]
14-May-2019 19:03:00 [INFO] --- maven-resources-plugin:2.6:testResources (default-testResources) @ coopr ---
14-May-2019 19:03:00 [INFO] Using 'UTF-8' encoding to copy filtered resources.
14-May-2019 19:03:00 [INFO] Copying 20 resources
14-May-2019 19:03:00 [INFO]
14-May-2019 19:03:00 [INFO] --- maven-compiler-plugin:3.1:testCompile (default-testCompile) @ coopr ---
14-May-2019 19:03:00 [INFO] Changes detected - recompiling the module!
14-May-2019 19:03:00 [INFO] Compiling 99 source files to /var/bamboo/xml-data/build-dir/COOP-DBT-JOB1/coopr-server/target/test-classes
14-May-2019 19:03:02 [WARNING] /var/bamboo/xml-data/build-dir/COOP-DBT-JOB1/coopr-server/src/test/java/co/cask/coopr/http/ServiceTestBase.java: /var/bamboo/xml-data/build-dir/COOP-DBT-JOB1/coopr-server/src/test/java/co/cask/coopr/http/ServiceTestBase.java uses or overrides a deprecated API.
14-May-2019 19:03:02 [WARNING] /var/bamboo/xml-data/build-dir/COOP-DBT-JOB1/coopr-server/src/test/java/co/cask/coopr/http/ServiceTestBase.java: Recompile with -Xlint:deprecation for details.
14-May-2019 19:03:02 [WARNING] /var/bamboo/xml-data/build-dir/COOP-DBT-JOB1/coopr-server/src/test/java/co/cask/coopr/Entities.java: /var/bamboo/xml-data/build-dir/COOP-DBT-JOB1/coopr-server/src/test/java/co/cask/coopr/Entities.java uses unchecked or unsafe operations.
14-May-2019 19:03:02 [WARNING] /var/bamboo/xml-data/build-dir/COOP-DBT-JOB1/coopr-server/src/test/java/co/cask/coopr/Entities.java: Recompile with -Xlint:unchecked for details.
14-May-2019 19:03:02 [INFO]
14-May-2019 19:03:02 [INFO] --- maven-surefire-plugin:2.14.1:test (default-test) @ coopr ---
14-May-2019 19:03:02 [INFO] Surefire report directory: /var/bamboo/xml-data/build-dir/COOP-DBT-JOB1/coopr-server/target/surefire-reports
14-May-2019 19:03:02
14-May-2019 19:03:02 -------------------------------------------------------
14-May-2019 19:03:02 T E S T S
14-May-2019 19:03:02 -------------------------------------------------------
14-May-2019 19:03:03 Running co.cask.coopr.scheduler.action.TaskDagTest
14-May-2019 19:03:07 Tests run: 3, Failures: 0, Errors: 0, Skipped: 0, Time elapsed: 3.735 sec
14-May-2019 19:03:07 Running co.cask.coopr.scheduler.ServiceDependencyResolverTest
14-May-2019 19:03:08 Tests run: 6, Failures: 0, Errors: 0, Skipped: 0, Time elapsed: 1.52 sec
14-May-2019 19:03:08 Running co.cask.coopr.scheduler.SolverSchedulerTest
14-May-2019 19:03:15 Tests run: 1, Failures: 0, Errors: 0, Skipped: 0, Time elapsed: 7.135 sec
14-May-2019 19:03:15 Running co.cask.coopr.scheduler.SchedulerTest
14-May-2019 19:04:05 Tests run: 5, Failures: 0, Errors: 2, Skipped: 0, Time elapsed: 50.056 sec <<< FAILURE!
14-May-2019 19:04:05 testSuccessCallbacks(co.cask.coopr.scheduler.SchedulerTest)  Time elapsed: 21.361 sec  <<< ERROR!
14-May-2019 19:04:05 java.lang.Exception: test timed out after 20000 milliseconds
14-May-2019 19:04:05         at java.net.SocketInputStream.socketRead0(Native Method)
14-May-2019 19:04:05         at java.net.SocketInputStream.read(SocketInputStream.java:152)
14-May-2019 19:04:05         at java.net.SocketInputStream.read(SocketInputStream.java:122)
14-May-2019 19:04:05         at org.apache.http.impl.io.SessionInputBufferImpl.streamRead(SessionInputBufferImpl.java:136)
14-May-2019 19:04:05         at org.apache.http.impl.io.SessionInputBufferImpl.fillBuffer(SessionInputBufferImpl.java:152)
14-May-2019 19:04:05         at org.apache.http.impl.io.SessionInputBufferImpl.readLine(SessionInputBufferImpl.java:270)
14-May-2019 19:04:05         at org.apache.http.impl.conn.DefaultHttpResponseParser.parseHead(DefaultHttpResponseParser.java:140)
14-May-2019 19:04:05         at org.apache.http.impl.conn.DefaultHttpResponseParser.parseHead(DefaultHttpResponseParser.java:57)
14-May-2019 19:04:05         at org.apache.http.impl.io.AbstractMessageParser.parse(AbstractMessageParser.java:260)
14-May-2019 19:04:05         at org.apache.http.impl.DefaultBHttpClientConnection.receiveResponseHeader(DefaultBHttpClientConnection.java:161)
14-May-2019 19:04:05         at sun.reflect.GeneratedMethodAccessor13.invoke(Unknown Source)
14-May-2019 19:04:05         at sun.reflect.DelegatingMethodAccessorImpl.invoke(DelegatingMethodAccessorImpl.java:43)
14-May-2019 19:04:05         at java.lang.reflect.Method.invoke(Method.java:606)
14-May-2019 19:04:05         at org.apache.http.impl.conn.CPoolProxy.invoke(CPoolProxy.java:138)
14-May-2019 19:04:05         at com.sun.proxy.$Proxy28.receiveResponseHeader(Unknown Source)
14-May-2019 19:04:05         at org.apache.http.protocol.HttpRequestExecutor.doReceiveResponse(HttpRequestExecutor.java:271)
14-May-2019 19:04:05         at org.apache.http.protocol.HttpRequestExecutor.execute(HttpRequestExecutor.java:123)
14-May-2019 19:04:05         at org.apache.http.impl.execchain.MainClientExec.execute(MainClientExec.java:254)
14-May-2019 19:04:05         at org.apache.http.impl.execchain.ProtocolExec.execute(ProtocolExec.java:195)
14-May-2019 19:04:05         at org.apache.http.impl.execchain.RetryExec.execute(RetryExec.java:86)
14-May-2019 19:04:05         at org.apache.http.impl.execchain.RedirectExec.execute(RedirectExec.java:108)
14-May-2019 19:04:05         at org.apache.http.impl.client.InternalHttpClient.doExecute(InternalHttpClient.java:186)
14-May-2019 19:04:05         at org.apache.http.impl.client.CloseableHttpClient.execute(CloseableHttpClient.java:82)
14-May-2019 19:04:05         at org.apache.http.impl.client.CloseableHttpClient.execute(CloseableHttpClient.java:106)
14-May-2019 19:04:05         at co.cask.coopr.TestHelper.takeTask(TestHelper.java:52)
14-May-2019 19:04:05         at co.cask.coopr.scheduler.SchedulerTest.testCallbacks(SchedulerTest.java:327)
14-May-2019 19:04:05         at co.cask.coopr.scheduler.SchedulerTest.testSuccessCallbacks(SchedulerTest.java:254)
14-May-2019 19:04:05
14-May-2019 19:04:05 testJobPause(co.cask.coopr.scheduler.SchedulerTest)  Time elapsed: 0.993 sec  <<< ERROR!
14-May-2019 19:04:05 java.io.IOException: java.sql.SQLNonTransientConnectionException: No current connection.
14-May-2019 19:04:05         at org.apache.derby.impl.jdbc.SQLExceptionFactory.getSQLException(Unknown Source)
14-May-2019 19:04:05         at org.apache.derby.impl.jdbc.SQLExceptionFactory40.wrapArgsForTransportAcrossDRDA(Unknown Source)
14-May-2019 19:04:05         at org.apache.derby.impl.jdbc.SQLExceptionFactory40.getSQLException(Unknown Source)
14-May-2019 19:04:05         at org.apache.derby.impl.jdbc.Util.newEmbedSQLException(Unknown Source)
14-May-2019 19:04:05         at org.apache.derby.impl.jdbc.Util.newEmbedSQLException(Unknown Source)
14-May-2019 19:04:05         at org.apache.derby.impl.jdbc.Util.noCurrentConnection(Unknown Source)
14-May-2019 19:04:05         at org.apache.derby.impl.jdbc.EmbedConnection.checkIfClosed(Unknown Source)
14-May-2019 19:04:05         at org.apache.derby.impl.jdbc.EmbedConnection.setAutoCommit(Unknown Source)
14-May-2019 19:04:05         at sun.reflect.GeneratedMethodAccessor2.invoke(Unknown Source)
14-May-2019 19:04:05         at sun.reflect.DelegatingMethodAccessorImpl.invoke(DelegatingMethodAccessorImpl.java:43)
14-May-2019 19:04:05         at java.lang.reflect.Method.invoke(Method.java:606)
14-May-2019 19:04:05         at org.apache.tomcat.jdbc.pool.ProxyConnection.invoke(ProxyConnection.java:126)
14-May-2019 19:04:05         at org.apache.tomcat.jdbc.pool.JdbcInterceptor.invoke(JdbcInterceptor.java:109)
14-May-2019 19:04:05         at org.apache.tomcat.jdbc.pool.interceptor.AbstractCreateStatementInterceptor.invoke(AbstractCreateStatementInterceptor.java:71)
14-May-2019 19:04:05         at org.apache.tomcat.jdbc.pool.JdbcInterceptor.invoke(JdbcInterceptor.java:109)
14-May-2019 19:04:05         at org.apache.tomcat.jdbc.pool.interceptor.ConnectionState.invoke(ConnectionState.java:153)
14-May-2019 19:04:05         at org.apache.tomcat.jdbc.pool.JdbcInterceptor.invoke(JdbcInterceptor.java:109)
14-May-2019 19:04:05         at org.apache.tomcat.jdbc.pool.TrapException.invoke(TrapException.java:41)
14-May-2019 19:04:05         at org.apache.tomcat.jdbc.pool.JdbcInterceptor.invoke(JdbcInterceptor.java:109)
14-May-2019 19:04:05         at org.apache.tomcat.jdbc.pool.DisposableConnectionFacade.invoke(DisposableConnectionFacade.java:80)
14-May-2019 19:04:05         at com.sun.proxy.$Proxy26.setAutoCommit(Unknown Source)
14-May-2019 19:04:05         at co.cask.coopr.store.DBConnectionPool.getConnection(DBConnectionPool.java:130)
14-May-2019 19:04:05         at co.cask.coopr.store.DBConnectionPool.getConnection(DBConnectionPool.java:118)
14-May-2019 19:04:05         at co.cask.coopr.store.tenant.SQLTenantStore.writeTenant(SQLTenantStore.java:191)
14-May-2019 19:04:05         at co.cask.coopr.http.ServiceTestBase.setupServiceTest(ServiceTestBase.java:137)
14-May-2019 19:04:05         at sun.reflect.NativeMethodAccessorImpl.invoke0(Native Method)
14-May-2019 19:04:05         at sun.reflect.NativeMethodAccessorImpl.invoke(NativeMethodAccessorImpl.java:57)
14-May-2019 19:04:05         at sun.reflect.DelegatingMethodAccessorImpl.invoke(DelegatingMethodAccessorImpl.java:43)
14-May-2019 19:04:05         at java.lang.reflect.Method.invoke(Method.java:606)
14-May-2019 19:04:05         at org.junit.runners.model.FrameworkMethod$1.runReflectiveCall(FrameworkMethod.java:47)
14-May-2019 19:04:05         at org.junit.internal.runners.model.ReflectiveCallable.run(ReflectiveCallable.java:12)
14-May-2019 19:04:05         at org.junit.runners.model.FrameworkMethod.invokeExplosively(FrameworkMethod.java:44)
14-May-2019 19:04:05         at org.junit.internal.runners.statements.RunBefores.evaluate(RunBefores.java:24)
14-May-2019 19:04:05         at org.junit.internal.runners.statements.RunAfters.evaluate(RunAfters.java:27)
14-May-2019 19:04:05         at org.junit.runners.ParentRunner.runLeaf(ParentRunner.java:271)
14-May-2019 19:04:05         at org.junit.runners.BlockJUnit4ClassRunner.runChild(BlockJUnit4ClassRunner.java:70)
14-May-2019 19:04:05         at org.junit.runners.BlockJUnit4ClassRunner.runChild(BlockJUnit4ClassRunner.java:50)
14-May-2019 19:04:05         at org.junit.runners.ParentRunner$3.run(ParentRunner.java:238)
14-May-2019 19:04:05         at org.junit.runners.ParentRunner$1.schedule(ParentRunner.java:63)
14-May-2019 19:04:05         at org.junit.runners.ParentRunner.runChildren(ParentRunner.java:236)
14-May-2019 19:04:05         at org.junit.runners.ParentRunner.access$000(ParentRunner.java:53)
14-May-2019 19:04:05         at org.junit.runners.ParentRunner$2.evaluate(ParentRunner.java:229)
14-May-2019 19:04:05         at org.junit.internal.runners.statements.RunBefores.evaluate(RunBefores.java:26)
14-May-2019 19:04:05         at org.junit.internal.runners.statements.RunAfters.evaluate(RunAfters.java:27)
14-May-2019 19:04:05         at org.junit.rules.ExternalResource$1.evaluate(ExternalResource.java:48)
14-May-2019 19:04:05         at org.junit.rules.RunRules.evaluate(RunRules.java:20)
14-May-2019 19:04:05         at org.junit.runners.ParentRunner.run(ParentRunner.java:309)
14-May-2019 19:04:05         at org.apache.maven.surefire.junit4.JUnit4Provider.execute(JUnit4Provider.java:264)
14-May-2019 19:04:05         at org.apache.maven.surefire.junit4.JUnit4Provider.executeTestSet(JUnit4Provider.java:153)
14-May-2019 19:04:05         at org.apache.maven.surefire.junit4.JUnit4Provider.invoke(JUnit4Provider.java:124)
14-May-2019 19:04:05         at sun.reflect.NativeMethodAccessorImpl.invoke0(Native Method)
14-May-2019 19:04:05         at sun.reflect.NativeMethodAccessorImpl.invoke(NativeMethodAccessorImpl.java:57)
14-May-2019 19:04:05         at sun.reflect.DelegatingMethodAccessorImpl.invoke(DelegatingMethodAccessorImpl.java:43)
14-May-2019 19:04:05         at java.lang.reflect.Method.invoke(Method.java:606)
14-May-2019 19:04:05         at org.apache.maven.surefire.util.ReflectionUtils.invokeMethodWithArray2(ReflectionUtils.java:208)
14-May-2019 19:04:05         at org.apache.maven.surefire.booter.ProviderFactory$ProviderProxy.invoke(ProviderFactory.java:159)
14-May-2019 19:04:05         at org.apache.maven.surefire.booter.ProviderFactory.invokeProvider(ProviderFactory.java:87)
14-May-2019 19:04:05         at org.apache.maven.surefire.booter.ForkedBooter.runSuitesInProcess(ForkedBooter.java:153)
14-May-2019 19:04:05         at org.apache.maven.surefire.booter.ForkedBooter.main(ForkedBooter.java:95)
14-May-2019 19:04:05
14-May-2019 19:04:05 Running co.cask.coopr.scheduler.ClusterCleanupTest
14-May-2019 19:04:15 Tests run: 4, Failures: 0, Errors: 0, Skipped: 0, Time elapsed: 9.736 sec
14-May-2019 19:04:15 Running co.cask.coopr.scheduler.callback.HttpPostClusterCallbackTest
14-May-2019 19:04:16 Tests run: 3, Failures: 0, Errors: 0, Skipped: 0, Time elapsed: 1.394 sec
14-May-2019 19:04:16 Running co.cask.coopr.scheduler.JobPlannerTest
14-May-2019 19:04:16 Tests run: 12, Failures: 0, Errors: 0, Skipped: 0, Time elapsed: 0.022 sec
14-May-2019 19:04:16 Running co.cask.coopr.scheduler.task.ClusterServiceTest
14-May-2019 19:04:21 Tests run: 9, Failures: 0, Errors: 0, Skipped: 0, Time elapsed: 4.623 sec
14-May-2019 19:04:21 Running co.cask.coopr.scheduler.task.TaskQueueServiceTest
14-May-2019 19:04:26 Tests run: 1, Failures: 0, Errors: 0, Skipped: 0, Time elapsed: 4.695 sec
14-May-2019 19:04:26 Running co.cask.coopr.scheduler.task.TaskServiceTest
14-May-2019 19:04:28 Tests run: 1, Failures: 0, Errors: 0, Skipped: 0, Time elapsed: 2.61 sec
14-May-2019 19:04:28 Running co.cask.coopr.scheduler.task.NodeServiceTest
14-May-2019 19:04:31 Tests run: 6, Failures: 0, Errors: 0, Skipped: 0, Time elapsed: 2.472 sec
14-May-2019 19:04:31 Running co.cask.coopr.store.credential.InProcessCredentialStoreTest
14-May-2019 19:04:31 Tests run: 1, Failures: 0, Errors: 0, Skipped: 0, Time elapsed: 0.001 sec
14-May-2019 19:04:31 Running co.cask.coopr.store.credential.SQLCredentialStoreTest
14-May-2019 19:04:31 Tests run: 1, Failures: 0, Errors: 0, Skipped: 0, Time elapsed: 0.133 sec
14-May-2019 19:04:31 Running co.cask.coopr.store.cluster.SQLClusterStoreTest
14-May-2019 19:04:32 Tests run: 16, Failures: 0, Errors: 0, Skipped: 0, Time elapsed: 0.888 sec
14-May-2019 19:04:32 Running co.cask.coopr.store.provisioner.MemoryPluginStoreTest
14-May-2019 19:04:32 Tests run: 7, Failures: 0, Errors: 0, Skipped: 0, Time elapsed: 0.008 sec
14-May-2019 19:04:32 Running co.cask.coopr.store.provisioner.LocalFilePluginStoreTest
14-May-2019 19:04:32 Tests run: 7, Failures: 0, Errors: 0, Skipped: 0, Time elapsed: 0.122 sec
14-May-2019 19:04:32 Running co.cask.coopr.store.provisioner.SQLProvisionerStoreTest
14-May-2019 19:04:32 Tests run: 9, Failures: 0, Errors: 0, Skipped: 0, Time elapsed: 0.388 sec
14-May-2019 19:04:32 Running co.cask.coopr.store.provisioner.SQLPluginResourceMetaStoreTest
14-May-2019 19:04:33 Tests run: 10, Failures: 0, Errors: 0, Skipped: 0, Time elapsed: 0.165 sec
14-May-2019 19:04:33 Running co.cask.coopr.store.node.SQLNodeStoreTest
14-May-2019 19:04:33 Tests run: 11, Failures: 0, Errors: 0, Skipped: 0, Time elapsed: 0.625 sec
14-May-2019 19:04:33 Running co.cask.coopr.store.tenant.SQLTenantStoreTest
14-May-2019 19:04:34 Tests run: 5, Failures: 0, Errors: 0, Skipped: 0, Time elapsed: 0.881 sec
14-May-2019 19:04:34 Running co.cask.coopr.store.entity.SQLEntityStoreServiceTest
14-May-2019 19:04:35 Tests run: 19, Failures: 0, Errors: 0, Skipped: 0, Time elapsed: 1.097 sec
14-May-2019 19:04:35 Running co.cask.coopr.store.user.SQLUserStoreTest
14-May-2019 19:04:36 Tests run: 1, Failures: 0, Errors: 0, Skipped: 0, Time elapsed: 0.626 sec
14-May-2019 19:04:36 Running co.cask.coopr.provisioner.HttpProvisionerRequestServiceTest
14-May-2019 19:04:36 Tests run: 2, Failures: 0, Errors: 0, Skipped: 0, Time elapsed: 0.154 sec
14-May-2019 19:04:36 Running co.cask.coopr.provisioner.ProvisionerTest
14-May-2019 19:04:36 Tests run: 5, Failures: 0, Errors: 0, Skipped: 0, Time elapsed: 0 sec
14-May-2019 19:04:36 Running co.cask.coopr.provisioner.TenantProvisionerServiceTest
14-May-2019 19:04:42 Tests run: 10, Failures: 0, Errors: 0, Skipped: 0, Time elapsed: 5.554 sec
14-May-2019 19:04:42 Running co.cask.coopr.http.PluginHandlerTest
14-May-2019 19:04:48 Tests run: 10, Failures: 0, Errors: 0, Skipped: 0, Time elapsed: 6.567 sec
14-May-2019 19:04:48 Running co.cask.coopr.http.TaskHandlerTest
14-May-2019 19:04:54 Tests run: 5, Failures: 0, Errors: 0, Skipped: 0, Time elapsed: 5.903 sec
14-May-2019 19:04:54 Running co.cask.coopr.http.RPCHandlerTest
14-May-2019 19:04:56 Tests run: 2, Failures: 0, Errors: 0, Skipped: 0, Time elapsed: 1.933 sec
14-May-2019 19:04:56 Running co.cask.coopr.http.MetricHandlerTest
14-May-2019 19:04:58 Tests run: 3, Failures: 0, Errors: 0, Skipped: 0, Time elapsed: 1.903 sec
14-May-2019 19:04:58 Running co.cask.coopr.http.UserHandlerTest
14-May-2019 19:05:00 Tests run: 1, Failures: 0, Errors: 0, Skipped: 0, Time elapsed: 1.547 sec
14-May-2019 19:05:00 Running co.cask.coopr.http.StatusHandlerTest
14-May-2019 19:05:01 Tests run: 1, Failures: 0, Errors: 0, Skipped: 0, Time elapsed: 1.715 sec
14-May-2019 19:05:01 Running co.cask.coopr.http.ClusterHandlerTest
14-May-2019 19:06:16 Tests run: 44, Failures: 0, Errors: 0, Skipped: 0, Time elapsed: 74.917 sec
14-May-2019 19:06:16 Running co.cask.coopr.http.AuthenticationServerTest
14-May-2019 19:06:29 Tests run: 4, Failures: 0, Errors: 0, Skipped: 0, Time elapsed: 12.91 sec
14-May-2019 19:06:29 Running co.cask.coopr.http.AdminHandlerTest
14-May-2019 19:06:40 Tests run: 19, Failures: 0, Errors: 0, Skipped: 0, Time elapsed: 10.448 sec
14-May-2019 19:06:40 Running co.cask.coopr.http.SuperadminHandlerTest
14-May-2019 19:06:48 Tests run: 14, Failures: 0, Errors: 0, Skipped: 0, Time elapsed: 8.18 sec
14-May-2019 19:06:48 Running co.cask.coopr.http.MutualAuthServerTest
14-May-2019 19:06:55 Tests run: 2, Failures: 0, Errors: 0, Skipped: 0, Time elapsed: 7.607 sec
14-May-2019 19:06:55 Running co.cask.coopr.http.ProvisionerHandlerTest
14-May-2019 19:07:00 Tests run: 8, Failures: 0, Errors: 0, Skipped: 0, Time elapsed: 4.924 sec
14-May-2019 19:07:00 Running co.cask.coopr.http.HttpsServerTest
14-May-2019 19:07:07 Tests run: 2, Failures: 0, Errors: 0, Skipped: 0, Time elapsed: 6.972 sec
14-May-2019 19:07:07 Running co.cask.coopr.http.NodeHandlerTest
14-May-2019 19:07:10 Tests run: 4, Failures: 0, Errors: 0, Skipped: 0, Time elapsed: 2.504 sec
14-May-2019 19:07:10 Running co.cask.coopr.layout.ClusterLayoutFinderTest
14-May-2019 19:07:11 Tests run: 3, Failures: 0, Errors: 0, Skipped: 0, Time elapsed: 1.279 sec
14-May-2019 19:07:11 Running co.cask.coopr.layout.SolverTest
14-May-2019 19:07:12 Tests run: 12, Failures: 0, Errors: 0, Skipped: 0, Time elapsed: 1.341 sec
14-May-2019 19:07:12 Running co.cask.coopr.layout.ClusterLayoutUpdaterTest
14-May-2019 19:07:14 Tests run: 4, Failures: 0, Errors: 0, Skipped: 0, Time elapsed: 1.866 sec
14-May-2019 19:07:14 Running co.cask.coopr.layout.ClusterLayoutTest
14-May-2019 19:07:14 Tests run: 5, Failures: 0, Errors: 0, Skipped: 0, Time elapsed: 0.001 sec
14-May-2019 19:07:14 Running co.cask.coopr.layout.NodeLayoutGeneratorTest
14-May-2019 19:07:16 Tests run: 7, Failures: 0, Errors: 0, Skipped: 0, Time elapsed: 1.314 sec
14-May-2019 19:07:16 Running co.cask.coopr.layout.SlottedCombinationIteratorTest
14-May-2019 19:07:16 Tests run: 15, Failures: 0, Errors: 0, Skipped: 0, Time elapsed: 0.001 sec
14-May-2019 19:07:16 Running co.cask.coopr.layout.change.ClusterLayoutTrackerTest
14-May-2019 19:07:16 Tests run: 2, Failures: 0, Errors: 0, Skipped: 0, Time elapsed: 0 sec
14-May-2019 19:07:16 Running co.cask.coopr.layout.change.AddServiceChangeIteratorTest
14-May-2019 19:07:16 Tests run: 3, Failures: 0, Errors: 0, Skipped: 0, Time elapsed: 0.003 sec
14-May-2019 19:07:16 Running co.cask.coopr.layout.change.AddServicesChangeTest
14-May-2019 19:07:17 Tests run: 3, Failures: 0, Errors: 0, Skipped: 0, Time elapsed: 1.745 sec
14-May-2019 19:07:17 Running co.cask.coopr.common.security.EncryptorTest
14-May-2019 19:07:17 Tests run: 1, Failures: 0, Errors: 0, Skipped: 0, Time elapsed: 0.028 sec
14-May-2019 19:07:17 Running co.cask.coopr.common.utils.StringUtilsTest
14-May-2019 19:07:17 Tests run: 2, Failures: 0, Errors: 0, Skipped: 0, Time elapsed: 0 sec
14-May-2019 19:07:17 Running co.cask.coopr.common.queue.internal.ElementsTrackingQueueCliToolTest
14-May-2019 19:07:21 Tests run: 1, Failures: 0, Errors: 0, Skipped: 0, Time elapsed: 3.235 sec
14-May-2019 19:07:21 Running co.cask.coopr.common.queue.internal.ZKQueueGroupTest
14-May-2019 19:07:56 Tests run: 12, Failures: 0, Errors: 0, Skipped: 0, Time elapsed: 35.774 sec
14-May-2019 19:07:56 Running co.cask.coopr.common.queue.internal.ElementsTrackingQueueZkTest
14-May-2019 19:09:04 Tests run: 2, Failures: 0, Errors: 0, Skipped: 0, Time elapsed: 67.923 sec
14-May-2019 19:09:04 Running co.cask.coopr.common.queue.internal.ElementsTrackingQueueInMemoryTest
14-May-2019 19:09:05 Tests run: 2, Failures: 0, Errors: 0, Skipped: 0, Time elapsed: 0.245 sec
14-May-2019 19:09:05 Running co.cask.coopr.common.zookeeper.lib.ZKMapTest
14-May-2019 19:09:05 Tests run: 1, Failures: 0, Errors: 0, Skipped: 0, Time elapsed: 0.514 sec
14-May-2019 19:09:05 Running co.cask.coopr.common.zookeeper.lib.ZKCollectionTest
14-May-2019 19:09:05 Tests run: 1, Failures: 0, Errors: 0, Skipped: 0, Time elapsed: 0.33 sec
14-May-2019 19:09:05 Running co.cask.coopr.common.zookeeper.lib.SynchronizedZKMapTest
14-May-2019 19:09:37 Tests run: 2, Failures: 0, Errors: 1, Skipped: 0, Time elapsed: 31.898 sec <<< FAILURE!
14-May-2019 19:09:37 testConcurrent(co.cask.coopr.common.zookeeper.lib.SynchronizedZKMapTest)  Time elapsed: 30.115 sec  <<< ERROR!
14-May-2019 19:09:37 java.lang.Exception: test timed out after 30000 milliseconds
14-May-2019 19:09:37         at java.lang.Object.wait(Native Method)
14-May-2019 19:09:37         at java.lang.Thread.join(Thread.java:1281)
14-May-2019 19:09:37         at java.lang.Thread.join(Thread.java:1355)
14-May-2019 19:09:37         at co.cask.coopr.common.zookeeper.lib.SynchronizedZKMapTest.testConcurrent(SynchronizedZKMapTest.java:124)
14-May-2019 19:09:37
14-May-2019 19:09:37 Running co.cask.coopr.common.zookeeper.lib.ReentrantDistributedLockTest
14-May-2019 19:09:56 Tests run: 8, Failures: 0, Errors: 0, Skipped: 0, Time elapsed: 18.901 sec
14-May-2019 19:09:56 Running co.cask.coopr.common.zookeeper.IdServiceTest
14-May-2019 19:11:04 Tests run: 1, Failures: 0, Errors: 0, Skipped: 0, Time elapsed: 67.56 sec
14-May-2019 19:11:04 Running co.cask.coopr.common.zookeeper.LeaderElectionTest
14-May-2019 19:11:14 Tests run: 3, Failures: 0, Errors: 0, Skipped: 0, Time elapsed: 10.037 sec
14-May-2019 19:11:14 Running co.cask.coopr.common.conf.ConfigurationTest
14-May-2019 19:11:14 Tests run: 1, Failures: 0, Errors: 0, Skipped: 0, Time elapsed: 0.007 sec
14-May-2019 19:11:14 Running co.cask.coopr.spec.template.LeaseDurationTest
14-May-2019 19:11:14 Tests run: 12, Failures: 0, Errors: 0, Skipped: 0, Time elapsed: 0.002 sec
14-May-2019 19:11:14 Running co.cask.coopr.spec.template.PartialTemplateTest
14-May-2019 19:11:15 Tests run: 13, Failures: 0, Errors: 0, Skipped: 0, Time elapsed: 1.409 sec
14-May-2019 19:11:15 Running co.cask.coopr.spec.template.SizeConstraintTest
14-May-2019 19:11:15 Tests run: 3, Failures: 0, Errors: 0, Skipped: 0, Time elapsed: 0.001 sec
14-May-2019 19:11:15 Running co.cask.coopr.spec.plugin.ProviderTypeTest
14-May-2019 19:11:16 Tests run: 2, Failures: 0, Errors: 0, Skipped: 0, Time elapsed: 0.968 sec
14-May-2019 19:11:16 Running co.cask.coopr.spec.plugin.ResourceTypeSpecificationTest
14-May-2019 19:11:16 Tests run: 4, Failures: 0, Errors: 0, Skipped: 0, Time elapsed: 0.001 sec
14-May-2019 19:11:16 Running co.cask.coopr.macro.ExpressionTest
14-May-2019 19:11:16 Tests run: 15, Failures: 0, Errors: 0, Skipped: 0, Time elapsed: 0.105 sec
14-May-2019 19:11:16 Running co.cask.coopr.macro.ParserTest
14-May-2019 19:11:16 Tests run: 2, Failures: 0, Errors: 0, Skipped: 0, Time elapsed: 0.046 sec
14-May-2019 19:11:16 Running co.cask.coopr.macro.eval.EvaluatorsTest
14-May-2019 19:11:16 Tests run: 1, Failures: 0, Errors: 0, Skipped: 0, Time elapsed: 0 sec
14-May-2019 19:11:16 Running co.cask.coopr.macro.ExpanderTest
14-May-2019 19:11:16 Tests run: 5, Failures: 0, Errors: 0, Skipped: 0, Time elapsed: 0.013 sec
14-May-2019 19:11:17
14-May-2019 19:11:17 Results :
14-May-2019 19:11:17
14-May-2019 19:11:17 Tests in error:
14-May-2019 19:11:17   SchedulerTest.testSuccessCallbacks:254->testCallbacks:327 »  test timed out af...
14-May-2019 19:11:17   SchedulerTest>ServiceTestBase.setupServiceTest:137 » IO java.sql.SQLNonTransie...
14-May-2019 19:11:17   SynchronizedZKMapTest.testConcurrent:124->Object.wait:-2 »  test timed out aft...
14-May-2019 19:11:17
14-May-2019 19:11:17 Tests run: 422, Failures: 0, Errors: 3, Skipped: 0
14-May-2019 19:11:17
14-May-2019 19:11:17 [INFO] ------------------------------------------------------------------------
14-May-2019 19:11:17 [INFO] Reactor Summary:
14-May-2019 19:11:17 [INFO]
14-May-2019 19:11:17 [INFO] Cask Coopr ........................................ SUCCESS [0.604s]
14-May-2019 19:11:17 [INFO] Coopr Server ...................................... FAILURE [8:42.043s]
14-May-2019 19:11:17 [INFO] Coopr REST Client API ............................. SKIPPED
14-May-2019 19:11:17 [INFO] Coopr CLI ......................................... SKIPPED
14-May-2019 19:11:17 [INFO] Coopr UI .......................................... SKIPPED
14-May-2019 19:11:17 [INFO] ------------------------------------------------------------------------
14-May-2019 19:11:17 [INFO] BUILD FAILURE
14-May-2019 19:11:17 [INFO] ------------------------------------------------------------------------
14-May-2019 19:11:17 [INFO] Total time: 8:43.097s
14-May-2019 19:11:17 [INFO] Finished at: Tue May 14 19:11:17 UTC 2019
14-May-2019 19:11:17 [INFO] Final Memory: 32M/378M
14-May-2019 19:11:17 [INFO] ------------------------------------------------------------------------
14-May-2019 19:11:17 [ERROR] Failed to execute goal org.apache.maven.plugins:maven-surefire-plugin:2.14.1:test (default-test) on project coopr: There are test failures.
14-May-2019 19:11:17 [ERROR]
14-May-2019 19:11:17 [ERROR] Please refer to /var/bamboo/xml-data/build-dir/COOP-DBT-JOB1/coopr-server/target/surefire-reports for the individual test results.
14-May-2019 19:11:17 [ERROR] -> [Help 1]
14-May-2019 19:11:17 [ERROR]
14-May-2019 19:11:17 [ERROR] To see the full stack trace of the errors, re-run Maven with the -e switch.
14-May-2019 19:11:17 [ERROR] Re-run Maven using the -X switch to enable full debug logging.
14-May-2019 19:11:17 [ERROR]
14-May-2019 19:11:17 [ERROR] For more information about the errors and possible solutions, please read the following articles:
14-May-2019 19:11:17 [ERROR] [Help 1] http://cwiki.apache.org/confluence/display/MAVEN/MojoFailureException
14-May-2019 19:11:17 [ERROR]
14-May-2019 19:11:17 [ERROR] After correcting the problems, you can resume the build with the command
14-May-2019 19:11:17 [ERROR]   mvn <goals> -rf :coopr
14-May-2019 19:11:17 Failing task since return code of [/opt/maven/bin/mvn --batch-mode -Djava.io.tmpdir=/tmp/COOP-DBT-JOB1 clean test] was 1 while expected 0
14-May-2019 19:11:17 Parsing test results under /var/bamboo/xml-data/build-dir/COOP-DBT-JOB1...
14-May-2019 19:11:20 Finished task 'Build and Unit Test' with result: Failed
14-May-2019 19:11:20 Running post build plugin 'Docker Container Cleanup'
14-May-2019 19:11:20 Running post build plugin 'NCover Results Collector'
14-May-2019 19:11:20 Running post build plugin 'Clover Results Collector'
14-May-2019 19:11:20 Running post build plugin 'npm Cache Cleanup'
14-May-2019 19:11:20 Running post build plugin 'Artifact Copier'
14-May-2019 19:11:20 Finalising the build...
14-May-2019 19:11:20 Stopping timer.
14-May-2019 19:11:20 Build COOP-DBT-JOB1-325 completed.
14-May-2019 19:11:20 Running on server: post build plugin 'NCover Results Collector'
14-May-2019 19:11:20 Running on server: post build plugin 'Build Hanging Detection Configuration'
14-May-2019 19:11:20 Running on server: post build plugin 'Clover Delta Calculator'
14-May-2019 19:11:20 Running on server: post build plugin 'Maven Dependencies Postprocessor'
14-May-2019 19:11:20 All post build plugins have finished
14-May-2019 19:11:20 Generating build results summary...
14-May-2019 19:11:21 Saving build results to disk...
14-May-2019 19:11:21 Logging substituted variables...
14-May-2019 19:11:21 Indexing build results...
14-May-2019 19:11:21 Finished building COOP-DBT-JOB1-325.