Clusters with the click

Build: #9 failed Changes by Chris Gianelloni

Test results

  • 384 tests in total
  • 16 tests failed
  • 8 minutes taken in total.
Existing test failures 16
Status Test Failing since View job Duration
org.openqa.selenium.NoSuchElementException: {"errorMessage":"Unable to find element with css selector '#username'","request":{"headers":{"Accept":"application/json, image/png","Connection":"Keep-Alive","Content-Length":"44","Content-Type":"application/json; charset=utf-8","Host":"localhost:24971"},"httpVersion":"1.1","method":"POST","post":"{\"using\":\"css selector\",\"value\":\"#username\"}","url":"/element","urlParsed":{"anchor":"","query":"","file":"element","directory":"/","path":"/element","relative":"/element","port":"","host":"","password":"","user":"","userInfo":"","authority":"","protocol":"","source":"/element","queryKey":{},"chunks":["element"]},"urlOriginal":"/session/f58b4cc0-42ad-11e4-b61f-2fb84d990e9c/element"}}
Command duration or timeout: 1.02 seconds
For documentation on this error, please visit: http://seleniumhq.org/exceptions/no_such_element.html
Build info: version: '2.34.0', revision: '11cd0ef93615408e0b6b3bfa28defe125906461a', time: '2013-08-06 11:43:14'
System info: os.name: 'Linux', os.arch: 'amd64', os.version: '3.2.0-60-generic', java.version: '1.6.0_45'
Session ID: f58b4cc0-42ad-11e4-b61f-2fb84d990e9c
Driver info: com.continuuity.test.drivers.CustomPhantomJSDriver
Capabilities [{platform=LINUX, acceptSslCerts=false, javascriptEnabled=true, browserName=phantomjs, rotatable=false, driverVersion=1.1.0, locationContextEnabled=false, version=1.9.7, databaseEnabled=false, cssSelectorsEnabled=true, handlesAlerts=false, browserConnectionEnabled=false, proxy={proxyType=direct}, webStorageEnabled=false, nativeEvents=true, driverName=ghostdriver, applicationCacheEnabled=false, takesScreenshot=true}]
org.openqa.selenium.NoSuchElementException: {"errorMessage":"Unable to find element with css selector '#username'","request":{"headers":{"Accept":"application/json, image/png","Connection":"Keep-Alive","Content-Length":"44","Content-Type":"application/json; charset=utf-8","Host":"localhost:22901"},"httpVersion":"1.1","method":"POST","post":"{\"using\":\"css selector\",\"value\":\"#username\"}","url":"/element","urlParsed":{"anchor":"","query":"","file":"element","directory":"/","path":"/element","relative":"/element","port":"","host":"","password":"","user":"","userInfo":"","authority":"","protocol":"","source":"/element","queryKey":{},"chunks":["element"]},"urlOriginal":"/session/f79eea80-42ad-11e4-8e6a-55d1fb9cb30c/element"}}
Command duration or timeout: 1.02 seconds
For documentation on this error, please visit: http://seleniumhq.org/exceptions/no_such_element.html
Build info: version: '2.34.0', revision: '11cd0ef93615408e0b6b3bfa28defe125906461a', time: '2013-08-06 11:43:14'
System info: os.name: 'Linux', os.arch: 'amd64', os.version: '3.2.0-60-generic', java.version: '1.6.0_45'
Session ID: f79eea80-42ad-11e4-8e6a-55d1fb9cb30c
Driver info: com.continuuity.test.drivers.CustomPhantomJSDriver
Capabilities [{platform=LINUX, acceptSslCerts=false, javascriptEnabled=true, browserName=phantomjs, rotatable=false, driverVersion=1.1.0, locationContextEnabled=false, version=1.9.7, databaseEnabled=false, cssSelectorsEnabled=true, handlesAlerts=false, browserConnectionEnabled=false, proxy={proxyType=direct}, webStorageEnabled=false, nativeEvents=true, driverName=ghostdriver, applicationCacheEnabled=false, takesScreenshot=true}]
org.openqa.selenium.NoSuchElementException: {"errorMessage":"Unable to find element with css selector '#username'","request":{"headers":{"Accept":"application/json, image/png","Connection":"Keep-Alive","Content-Length":"44","Content-Type":"application/json; charset=utf-8","Host":"localhost:15811"},"httpVersion":"1.1","method":"POST","post":"{\"using\":\"css selector\",\"value\":\"#username\"}","url":"/element","urlParsed":{"anchor":"","query":"","file":"element","directory":"/","path":"/element","relative":"/element","port":"","host":"","password":"","user":"","userInfo":"","authority":"","protocol":"","source":"/element","queryKey":{},"chunks":["element"]},"urlOriginal":"/session/f9b48410-42ad-11e4-ba96-bb75e11fc331/element"}}
Command duration or timeout: 1.01 seconds
For documentation on this error, please visit: http://seleniumhq.org/exceptions/no_such_element.html
Build info: version: '2.34.0', revision: '11cd0ef93615408e0b6b3bfa28defe125906461a', time: '2013-08-06 11:43:14'
System info: os.name: 'Linux', os.arch: 'amd64', os.version: '3.2.0-60-generic', java.version: '1.6.0_45'
Session ID: f9b48410-42ad-11e4-ba96-bb75e11fc331
Driver info: com.continuuity.test.drivers.CustomPhantomJSDriver
Capabilities [{platform=LINUX, acceptSslCerts=false, javascriptEnabled=true, browserName=phantomjs, rotatable=false, driverVersion=1.1.0, locationContextEnabled=false, version=1.9.7, databaseEnabled=false, cssSelectorsEnabled=true, handlesAlerts=false, browserConnectionEnabled=false, proxy={proxyType=direct}, webStorageEnabled=false, nativeEvents=true, driverName=ghostdriver, applicationCacheEnabled=false, takesScreenshot=true}]
org.openqa.selenium.NoSuchElementException: {"errorMessage":"Unable to find element with css selector '#username'","request":{"headers":{"Accept":"application/json, image/png","Connection":"Keep-Alive","Content-Length":"44","Content-Type":"application/json; charset=utf-8","Host":"localhost:4455"},"httpVersion":"1.1","method":"POST","post":"{\"using\":\"css selector\",\"value\":\"#username\"}","url":"/element","urlParsed":{"anchor":"","query":"","file":"element","directory":"/","path":"/element","relative":"/element","port":"","host":"","password":"","user":"","userInfo":"","authority":"","protocol":"","source":"/element","queryKey":{},"chunks":["element"]},"urlOriginal":"/session/fba72c50-42ad-11e4-a441-8f393e295cd6/element"}}
Command duration or timeout: 1.02 seconds
For documentation on this error, please visit: http://seleniumhq.org/exceptions/no_such_element.html
Build info: version: '2.34.0', revision: '11cd0ef93615408e0b6b3bfa28defe125906461a', time: '2013-08-06 11:43:14'
System info: os.name: 'Linux', os.arch: 'amd64', os.version: '3.2.0-60-generic', java.version: '1.6.0_45'
Session ID: fba72c50-42ad-11e4-a441-8f393e295cd6
Driver info: com.continuuity.test.drivers.CustomPhantomJSDriver
Capabilities [{platform=LINUX, acceptSslCerts=false, javascriptEnabled=true, browserName=phantomjs, rotatable=false, driverVersion=1.1.0, locationContextEnabled=false, version=1.9.7, databaseEnabled=false, cssSelectorsEnabled=true, handlesAlerts=false, browserConnectionEnabled=false, proxy={proxyType=direct}, webStorageEnabled=false, nativeEvents=true, driverName=ghostdriver, applicationCacheEnabled=false, takesScreenshot=true}]
org.openqa.selenium.NoSuchElementException: {"errorMessage":"Unable to find element with css selector '#username'","request":{"headers":{"Accept":"application/json, image/png","Connection":"Keep-Alive","Content-Length":"44","Content-Type":"application/json; charset=utf-8","Host":"localhost:17054"},"httpVersion":"1.1","method":"POST","post":"{\"using\":\"css selector\",\"value\":\"#username\"}","url":"/element","urlParsed":{"anchor":"","query":"","file":"element","directory":"/","path":"/element","relative":"/element","port":"","host":"","password":"","user":"","userInfo":"","authority":"","protocol":"","source":"/element","queryKey":{},"chunks":["element"]},"urlOriginal":"/session/ff8f6300-42ad-11e4-8309-fda8a07304cf/element"}}
Command duration or timeout: 1.02 seconds
For documentation on this error, please visit: http://seleniumhq.org/exceptions/no_such_element.html
Build info: version: '2.34.0', revision: '11cd0ef93615408e0b6b3bfa28defe125906461a', time: '2013-08-06 11:43:14'
System info: os.name: 'Linux', os.arch: 'amd64', os.version: '3.2.0-60-generic', java.version: '1.6.0_45'
Session ID: ff8f6300-42ad-11e4-8309-fda8a07304cf
Driver info: com.continuuity.test.drivers.CustomPhantomJSDriver
Capabilities [{platform=LINUX, acceptSslCerts=false, javascriptEnabled=true, browserName=phantomjs, rotatable=false, driverVersion=1.1.0, locationContextEnabled=false, version=1.9.7, databaseEnabled=false, cssSelectorsEnabled=true, handlesAlerts=false, browserConnectionEnabled=false, proxy={proxyType=direct}, webStorageEnabled=false, nativeEvents=true, driverName=ghostdriver, applicationCacheEnabled=false, takesScreenshot=true}]
org.openqa.selenium.NoSuchElementException: {"errorMessage":"Unable to find element with css selector '#username'","request":{"headers":{"Accept":"application/json, image/png","Connection":"Keep-Alive","Content-Length":"44","Content-Type":"application/json; charset=utf-8","Host":"localhost:21185"},"httpVersion":"1.1","method":"POST","post":"{\"using\":\"css selector\",\"value\":\"#username\"}","url":"/element","urlParsed":{"anchor":"","query":"","file":"element","directory":"/","path":"/element","relative":"/element","port":"","host":"","password":"","user":"","userInfo":"","authority":"","protocol":"","source":"/element","queryKey":{},"chunks":["element"]},"urlOriginal":"/session/fd9c1e80-42ad-11e4-a93e-57497fa7b5d8/element"}}
Command duration or timeout: 1.00 seconds
For documentation on this error, please visit: http://seleniumhq.org/exceptions/no_such_element.html
Build info: version: '2.34.0', revision: '11cd0ef93615408e0b6b3bfa28defe125906461a', time: '2013-08-06 11:43:14'
System info: os.name: 'Linux', os.arch: 'amd64', os.version: '3.2.0-60-generic', java.version: '1.6.0_45'
Session ID: fd9c1e80-42ad-11e4-a93e-57497fa7b5d8
Driver info: com.continuuity.test.drivers.CustomPhantomJSDriver
Capabilities [{platform=LINUX, acceptSslCerts=false, javascriptEnabled=true, browserName=phantomjs, rotatable=false, driverVersion=1.1.0, locationContextEnabled=false, version=1.9.7, databaseEnabled=false, cssSelectorsEnabled=true, handlesAlerts=false, browserConnectionEnabled=false, proxy={proxyType=direct}, webStorageEnabled=false, nativeEvents=true, driverName=ghostdriver, applicationCacheEnabled=false, takesScreenshot=true}]
org.openqa.selenium.NoSuchElementException: {"errorMessage":"Unable to find element with css selector '#username'","request":{"headers":{"Accept":"application/json, image/png","Connection":"Keep-Alive","Content-Length":"44","Content-Type":"application/json; charset=utf-8","Host":"localhost:11587"},"httpVersion":"1.1","method":"POST","post":"{\"using\":\"css selector\",\"value\":\"#username\"}","url":"/element","urlParsed":{"anchor":"","query":"","file":"element","directory":"/","path":"/element","relative":"/element","port":"","host":"","password":"","user":"","userInfo":"","authority":"","protocol":"","source":"/element","queryKey":{},"chunks":["element"]},"urlOriginal":"/session/01831cb0-42ae-11e4-8d13-efab08847a92/element"}}
Command duration or timeout: 1.03 seconds
For documentation on this error, please visit: http://seleniumhq.org/exceptions/no_such_element.html
Build info: version: '2.34.0', revision: '11cd0ef93615408e0b6b3bfa28defe125906461a', time: '2013-08-06 11:43:14'
System info: os.name: 'Linux', os.arch: 'amd64', os.version: '3.2.0-60-generic', java.version: '1.6.0_45'
Session ID: 01831cb0-42ae-11e4-8d13-efab08847a92
Driver info: com.continuuity.test.drivers.CustomPhantomJSDriver
Capabilities [{platform=LINUX, acceptSslCerts=false, javascriptEnabled=true, browserName=phantomjs, rotatable=false, driverVersion=1.1.0, locationContextEnabled=false, version=1.9.7, databaseEnabled=false, cssSelectorsEnabled=true, handlesAlerts=false, browserConnectionEnabled=false, proxy={proxyType=direct}, webStorageEnabled=false, nativeEvents=true, driverName=ghostdriver, applicationCacheEnabled=false, takesScreenshot=true}]
org.openqa.selenium.NoSuchElementException: {"errorMessage":"Unable to find element with css selector '#username'","request":{"headers":{"Accept":"application/json, image/png","Connection":"Keep-Alive","Content-Length":"44","Content-Type":"application/json; charset=utf-8","Host":"localhost:23221"},"httpVersion":"1.1","method":"POST","post":"{\"using\":\"css selector\",\"value\":\"#username\"}","url":"/element","urlParsed":{"anchor":"","query":"","file":"element","directory":"/","path":"/element","relative":"/element","port":"","host":"","password":"","user":"","userInfo":"","authority":"","protocol":"","source":"/element","queryKey":{},"chunks":["element"]},"urlOriginal":"/session/037772a0-42ae-11e4-b917-091e4dbfe56e/element"}}
Command duration or timeout: 1.02 seconds
For documentation on this error, please visit: http://seleniumhq.org/exceptions/no_such_element.html
Build info: version: '2.34.0', revision: '11cd0ef93615408e0b6b3bfa28defe125906461a', time: '2013-08-06 11:43:14'
System info: os.name: 'Linux', os.arch: 'amd64', os.version: '3.2.0-60-generic', java.version: '1.6.0_45'
Session ID: 037772a0-42ae-11e4-b917-091e4dbfe56e
Driver info: com.continuuity.test.drivers.CustomPhantomJSDriver
Capabilities [{platform=LINUX, acceptSslCerts=false, javascriptEnabled=true, browserName=phantomjs, rotatable=false, driverVersion=1.1.0, locationContextEnabled=false, version=1.9.7, databaseEnabled=false, cssSelectorsEnabled=true, handlesAlerts=false, browserConnectionEnabled=false, proxy={proxyType=direct}, webStorageEnabled=false, nativeEvents=true, driverName=ghostdriver, applicationCacheEnabled=false, takesScreenshot=true}]
org.openqa.selenium.NoSuchElementException: {"errorMessage":"Unable to find element with css selector '#username'","request":{"headers":{"Accept":"application/json, image/png","Connection":"Keep-Alive","Content-Length":"44","Content-Type":"application/json; charset=utf-8","Host":"localhost:10844"},"httpVersion":"1.1","method":"POST","post":"{\"using\":\"css selector\",\"value\":\"#username\"}","url":"/element","urlParsed":{"anchor":"","query":"","file":"element","directory":"/","path":"/element","relative":"/element","port":"","host":"","password":"","user":"","userInfo":"","authority":"","protocol":"","source":"/element","queryKey":{},"chunks":["element"]},"urlOriginal":"/session/056ba180-42ae-11e4-949c-4731ab4db13a/element"}}
Command duration or timeout: 1.02 seconds
For documentation on this error, please visit: http://seleniumhq.org/exceptions/no_such_element.html
Build info: version: '2.34.0', revision: '11cd0ef93615408e0b6b3bfa28defe125906461a', time: '2013-08-06 11:43:14'
System info: os.name: 'Linux', os.arch: 'amd64', os.version: '3.2.0-60-generic', java.version: '1.6.0_45'
Session ID: 056ba180-42ae-11e4-949c-4731ab4db13a
Driver info: com.continuuity.test.drivers.CustomPhantomJSDriver
Capabilities [{platform=LINUX, acceptSslCerts=false, javascriptEnabled=true, browserName=phantomjs, rotatable=false, driverVersion=1.1.0, locationContextEnabled=false, version=1.9.7, databaseEnabled=false, cssSelectorsEnabled=true, handlesAlerts=false, browserConnectionEnabled=false, proxy={proxyType=direct}, webStorageEnabled=false, nativeEvents=true, driverName=ghostdriver, applicationCacheEnabled=false, takesScreenshot=true}]
org.openqa.selenium.NoSuchElementException: {"errorMessage":"Unable to find element with css selector '#username'","request":{"headers":{"Accept":"application/json, image/png","Connection":"Keep-Alive","Content-Length":"44","Content-Type":"application/json; charset=utf-8","Host":"localhost:22268"},"httpVersion":"1.1","method":"POST","post":"{\"using\":\"css selector\",\"value\":\"#username\"}","url":"/element","urlParsed":{"anchor":"","query":"","file":"element","directory":"/","path":"/element","relative":"/element","port":"","host":"","password":"","user":"","userInfo":"","authority":"","protocol":"","source":"/element","queryKey":{},"chunks":["element"]},"urlOriginal":"/session/07604590-42ae-11e4-88bc-edd6d7b3cba7/element"}}
Command duration or timeout: 1.01 seconds
For documentation on this error, please visit: http://seleniumhq.org/exceptions/no_such_element.html
Build info: version: '2.34.0', revision: '11cd0ef93615408e0b6b3bfa28defe125906461a', time: '2013-08-06 11:43:14'
System info: os.name: 'Linux', os.arch: 'amd64', os.version: '3.2.0-60-generic', java.version: '1.6.0_45'
Session ID: 07604590-42ae-11e4-88bc-edd6d7b3cba7
Driver info: com.continuuity.test.drivers.CustomPhantomJSDriver
Capabilities [{platform=LINUX, acceptSslCerts=false, javascriptEnabled=true, browserName=phantomjs, rotatable=false, driverVersion=1.1.0, locationContextEnabled=false, version=1.9.7, databaseEnabled=false, cssSelectorsEnabled=true, handlesAlerts=false, browserConnectionEnabled=false, proxy={proxyType=direct}, webStorageEnabled=false, nativeEvents=true, driverName=ghostdriver, applicationCacheEnabled=false, takesScreenshot=true}]
org.openqa.selenium.NoSuchElementException: {"errorMessage":"Unable to find element with css selector '#username'","request":{"headers":{"Accept":"application/json, image/png","Connection":"Keep-Alive","Content-Length":"44","Content-Type":"application/json; charset=utf-8","Host":"localhost:20927"},"httpVersion":"1.1","method":"POST","post":"{\"using\":\"css selector\",\"value\":\"#username\"}","url":"/element","urlParsed":{"anchor":"","query":"","file":"element","directory":"/","path":"/element","relative":"/element","port":"","host":"","password":"","user":"","userInfo":"","authority":"","protocol":"","source":"/element","queryKey":{},"chunks":["element"]},"urlOriginal":"/session/09533bf0-42ae-11e4-9acb-516c1d81fb34/element"}}
Command duration or timeout: 1.00 seconds
For documentation on this error, please visit: http://seleniumhq.org/exceptions/no_such_element.html
Build info: version: '2.34.0', revision: '11cd0ef93615408e0b6b3bfa28defe125906461a', time: '2013-08-06 11:43:14'
System info: os.name: 'Linux', os.arch: 'amd64', os.version: '3.2.0-60-generic', java.version: '1.6.0_45'
Session ID: 09533bf0-42ae-11e4-9acb-516c1d81fb34
Driver info: com.continuuity.test.drivers.CustomPhantomJSDriver
Capabilities [{platform=LINUX, acceptSslCerts=false, javascriptEnabled=true, browserName=phantomjs, rotatable=false, driverVersion=1.1.0, locationContextEnabled=false, version=1.9.7, databaseEnabled=false, cssSelectorsEnabled=true, handlesAlerts=false, browserConnectionEnabled=false, proxy={proxyType=direct}, webStorageEnabled=false, nativeEvents=true, driverName=ghostdriver, applicationCacheEnabled=false, takesScreenshot=true}]
org.openqa.selenium.NoSuchElementException: {"errorMessage":"Unable to find element with css selector '#username'","request":{"headers":{"Accept":"application/json, image/png","Connection":"Keep-Alive","Content-Length":"44","Content-Type":"application/json; charset=utf-8","Host":"localhost:13627"},"httpVersion":"1.1","method":"POST","post":"{\"using\":\"css selector\",\"value\":\"#username\"}","url":"/element","urlParsed":{"anchor":"","query":"","file":"element","directory":"/","path":"/element","relative":"/element","port":"","host":"","password":"","user":"","userInfo":"","authority":"","protocol":"","source":"/element","queryKey":{},"chunks":["element"]},"urlOriginal":"/session/0b44d2c0-42ae-11e4-a7c9-85cad6e2b543/element"}}
Command duration or timeout: 1.01 seconds
For documentation on this error, please visit: http://seleniumhq.org/exceptions/no_such_element.html
Build info: version: '2.34.0', revision: '11cd0ef93615408e0b6b3bfa28defe125906461a', time: '2013-08-06 11:43:14'
System info: os.name: 'Linux', os.arch: 'amd64', os.version: '3.2.0-60-generic', java.version: '1.6.0_45'
Session ID: 0b44d2c0-42ae-11e4-a7c9-85cad6e2b543
Driver info: com.continuuity.test.drivers.CustomPhantomJSDriver
Capabilities [{platform=LINUX, acceptSslCerts=false, javascriptEnabled=true, browserName=phantomjs, rotatable=false, driverVersion=1.1.0, locationContextEnabled=false, version=1.9.7, databaseEnabled=false, cssSelectorsEnabled=true, handlesAlerts=false, browserConnectionEnabled=false, proxy={proxyType=direct}, webStorageEnabled=false, nativeEvents=true, driverName=ghostdriver, applicationCacheEnabled=false, takesScreenshot=true}]
org.openqa.selenium.NoSuchElementException: {"errorMessage":"Unable to find element with css selector '#username'","request":{"headers":{"Accept":"application/json, image/png","Connection":"Keep-Alive","Content-Length":"44","Content-Type":"application/json; charset=utf-8","Host":"localhost:15329"},"httpVersion":"1.1","method":"POST","post":"{\"using\":\"css selector\",\"value\":\"#username\"}","url":"/element","urlParsed":{"anchor":"","query":"","file":"element","directory":"/","path":"/element","relative":"/element","port":"","host":"","password":"","user":"","userInfo":"","authority":"","protocol":"","source":"/element","queryKey":{},"chunks":["element"]},"urlOriginal":"/session/0d36b7b0-42ae-11e4-b7c1-495c1e3e7f2a/element"}}
Command duration or timeout: 1.01 seconds
For documentation on this error, please visit: http://seleniumhq.org/exceptions/no_such_element.html
Build info: version: '2.34.0', revision: '11cd0ef93615408e0b6b3bfa28defe125906461a', time: '2013-08-06 11:43:14'
System info: os.name: 'Linux', os.arch: 'amd64', os.version: '3.2.0-60-generic', java.version: '1.6.0_45'
Session ID: 0d36b7b0-42ae-11e4-b7c1-495c1e3e7f2a
Driver info: com.continuuity.test.drivers.CustomPhantomJSDriver
Capabilities [{platform=LINUX, acceptSslCerts=false, javascriptEnabled=true, browserName=phantomjs, rotatable=false, driverVersion=1.1.0, locationContextEnabled=false, version=1.9.7, databaseEnabled=false, cssSelectorsEnabled=true, handlesAlerts=false, browserConnectionEnabled=false, proxy={proxyType=direct}, webStorageEnabled=false, nativeEvents=true, driverName=ghostdriver, applicationCacheEnabled=false, takesScreenshot=true}]
org.openqa.selenium.NoSuchElementException: {"errorMessage":"Unable to find element with css selector '#username'","request":{"headers":{"Accept":"application/json, image/png","Connection":"Keep-Alive","Content-Length":"44","Content-Type":"application/json; charset=utf-8","Host":"localhost:20363"},"httpVersion":"1.1","method":"POST","post":"{\"using\":\"css selector\",\"value\":\"#username\"}","url":"/element","urlParsed":{"anchor":"","query":"","file":"element","directory":"/","path":"/element","relative":"/element","port":"","host":"","password":"","user":"","userInfo":"","authority":"","protocol":"","source":"/element","queryKey":{},"chunks":["element"]},"urlOriginal":"/session/0f280060-42ae-11e4-a999-19d3e2c6d780/element"}}
Command duration or timeout: 1.01 seconds
For documentation on this error, please visit: http://seleniumhq.org/exceptions/no_such_element.html
Build info: version: '2.34.0', revision: '11cd0ef93615408e0b6b3bfa28defe125906461a', time: '2013-08-06 11:43:14'
System info: os.name: 'Linux', os.arch: 'amd64', os.version: '3.2.0-60-generic', java.version: '1.6.0_45'
Session ID: 0f280060-42ae-11e4-a999-19d3e2c6d780
Driver info: com.continuuity.test.drivers.CustomPhantomJSDriver
Capabilities [{platform=LINUX, acceptSslCerts=false, javascriptEnabled=true, browserName=phantomjs, rotatable=false, driverVersion=1.1.0, locationContextEnabled=false, version=1.9.7, databaseEnabled=false, cssSelectorsEnabled=true, handlesAlerts=false, browserConnectionEnabled=false, proxy={proxyType=direct}, webStorageEnabled=false, nativeEvents=true, driverName=ghostdriver, applicationCacheEnabled=false, takesScreenshot=true}]
org.openqa.selenium.NoSuchElementException: {"errorMessage":"Unable to find element with css selector '#username'","request":{"headers":{"Accept":"application/json, image/png","Connection":"Keep-Alive","Content-Length":"44","Content-Type":"application/json; charset=utf-8","Host":"localhost:24989"},"httpVersion":"1.1","method":"POST","post":"{\"using\":\"css selector\",\"value\":\"#username\"}","url":"/element","urlParsed":{"anchor":"","query":"","file":"element","directory":"/","path":"/element","relative":"/element","port":"","host":"","password":"","user":"","userInfo":"","authority":"","protocol":"","source":"/element","queryKey":{},"chunks":["element"]},"urlOriginal":"/session/111acfb0-42ae-11e4-8212-b12cc6230601/element"}}
Command duration or timeout: 1.02 seconds
For documentation on this error, please visit: http://seleniumhq.org/exceptions/no_such_element.html
Build info: version: '2.34.0', revision: '11cd0ef93615408e0b6b3bfa28defe125906461a', time: '2013-08-06 11:43:14'
System info: os.name: 'Linux', os.arch: 'amd64', os.version: '3.2.0-60-generic', java.version: '1.6.0_45'
Session ID: 111acfb0-42ae-11e4-8212-b12cc6230601
Driver info: com.continuuity.test.drivers.CustomPhantomJSDriver
Capabilities [{platform=LINUX, acceptSslCerts=false, javascriptEnabled=true, browserName=phantomjs, rotatable=false, driverVersion=1.1.0, locationContextEnabled=false, version=1.9.7, databaseEnabled=false, cssSelectorsEnabled=true, handlesAlerts=false, browserConnectionEnabled=false, proxy={proxyType=direct}, webStorageEnabled=false, nativeEvents=true, driverName=ghostdriver, applicationCacheEnabled=false, takesScreenshot=true}]
org.openqa.selenium.NoSuchElementException: {"errorMessage":"Unable to find element with css selector '#username'","request":{"headers":{"Accept":"application/json, image/png","Connection":"Keep-Alive","Content-Length":"44","Content-Type":"application/json; charset=utf-8","Host":"localhost:20388"},"httpVersion":"1.1","method":"POST","post":"{\"using\":\"css selector\",\"value\":\"#username\"}","url":"/element","urlParsed":{"anchor":"","query":"","file":"element","directory":"/","path":"/element","relative":"/element","port":"","host":"","password":"","user":"","userInfo":"","authority":"","protocol":"","source":"/element","queryKey":{},"chunks":["element"]},"urlOriginal":"/session/130eb070-42ae-11e4-bda9-6bc1f93f7de0/element"}}
Command duration or timeout: 1.04 seconds
For documentation on this error, please visit: http://seleniumhq.org/exceptions/no_such_element.html
Build info: version: '2.34.0', revision: '11cd0ef93615408e0b6b3bfa28defe125906461a', time: '2013-08-06 11:43:14'
System info: os.name: 'Linux', os.arch: 'amd64', os.version: '3.2.0-60-generic', java.version: '1.6.0_45'
Session ID: 130eb070-42ae-11e4-bda9-6bc1f93f7de0
Driver info: com.continuuity.test.drivers.CustomPhantomJSDriver
Capabilities [{platform=LINUX, acceptSslCerts=false, javascriptEnabled=true, browserName=phantomjs, rotatable=false, driverVersion=1.1.0, locationContextEnabled=false, version=1.9.7, databaseEnabled=false, cssSelectorsEnabled=true, handlesAlerts=false, browserConnectionEnabled=false, proxy={proxyType=direct}, webStorageEnabled=false, nativeEvents=true, driverName=ghostdriver, applicationCacheEnabled=false, takesScreenshot=true}]