Clusters with the click

Build: #8 failed Changes by Chris Gianelloni

Test results

  • 384 tests in total
  • 16 tests failed
  • 8 minutes taken in total.
Existing test failures 16
Status Test Failing since View job Duration
org.openqa.selenium.NoSuchElementException: {"errorMessage":"Unable to find element with css selector '#username'","request":{"headers":{"Accept":"application/json, image/png","Connection":"Keep-Alive","Content-Length":"44","Content-Type":"application/json; charset=utf-8","Host":"localhost:20703"},"httpVersion":"1.1","method":"POST","post":"{\"using\":\"css selector\",\"value\":\"#username\"}","url":"/element","urlParsed":{"anchor":"","query":"","file":"element","directory":"/","path":"/element","relative":"/element","port":"","host":"","password":"","user":"","userInfo":"","authority":"","protocol":"","source":"/element","queryKey":{},"chunks":["element"]},"urlOriginal":"/session/f99005c0-42a5-11e4-8c2b-c36cde1eb615/element"}}
Command duration or timeout: 1.01 seconds
For documentation on this error, please visit: http://seleniumhq.org/exceptions/no_such_element.html
Build info: version: '2.34.0', revision: '11cd0ef93615408e0b6b3bfa28defe125906461a', time: '2013-08-06 11:43:14'
System info: os.name: 'Linux', os.arch: 'amd64', os.version: '3.2.0-60-generic', java.version: '1.6.0_45'
Session ID: f99005c0-42a5-11e4-8c2b-c36cde1eb615
Driver info: com.continuuity.test.drivers.CustomPhantomJSDriver
Capabilities [{platform=LINUX, acceptSslCerts=false, javascriptEnabled=true, browserName=phantomjs, rotatable=false, driverVersion=1.1.0, locationContextEnabled=false, version=1.9.7, databaseEnabled=false, cssSelectorsEnabled=true, handlesAlerts=false, browserConnectionEnabled=false, proxy={proxyType=direct}, webStorageEnabled=false, nativeEvents=true, driverName=ghostdriver, applicationCacheEnabled=false, takesScreenshot=true}]
org.openqa.selenium.NoSuchElementException: {"errorMessage":"Unable to find element with css selector '#username'","request":{"headers":{"Accept":"application/json, image/png","Connection":"Keep-Alive","Content-Length":"44","Content-Type":"application/json; charset=utf-8","Host":"localhost:27090"},"httpVersion":"1.1","method":"POST","post":"{\"using\":\"css selector\",\"value\":\"#username\"}","url":"/element","urlParsed":{"anchor":"","query":"","file":"element","directory":"/","path":"/element","relative":"/element","port":"","host":"","password":"","user":"","userInfo":"","authority":"","protocol":"","source":"/element","queryKey":{},"chunks":["element"]},"urlOriginal":"/session/fba6fee0-42a5-11e4-8cb1-a91149b1b6d4/element"}}
Command duration or timeout: 1.00 seconds
For documentation on this error, please visit: http://seleniumhq.org/exceptions/no_such_element.html
Build info: version: '2.34.0', revision: '11cd0ef93615408e0b6b3bfa28defe125906461a', time: '2013-08-06 11:43:14'
System info: os.name: 'Linux', os.arch: 'amd64', os.version: '3.2.0-60-generic', java.version: '1.6.0_45'
Session ID: fba6fee0-42a5-11e4-8cb1-a91149b1b6d4
Driver info: com.continuuity.test.drivers.CustomPhantomJSDriver
Capabilities [{platform=LINUX, acceptSslCerts=false, javascriptEnabled=true, browserName=phantomjs, rotatable=false, driverVersion=1.1.0, locationContextEnabled=false, version=1.9.7, databaseEnabled=false, cssSelectorsEnabled=true, handlesAlerts=false, browserConnectionEnabled=false, proxy={proxyType=direct}, webStorageEnabled=false, nativeEvents=true, driverName=ghostdriver, applicationCacheEnabled=false, takesScreenshot=true}]
org.openqa.selenium.NoSuchElementException: {"errorMessage":"Unable to find element with css selector '#username'","request":{"headers":{"Accept":"application/json, image/png","Connection":"Keep-Alive","Content-Length":"44","Content-Type":"application/json; charset=utf-8","Host":"localhost:2543"},"httpVersion":"1.1","method":"POST","post":"{\"using\":\"css selector\",\"value\":\"#username\"}","url":"/element","urlParsed":{"anchor":"","query":"","file":"element","directory":"/","path":"/element","relative":"/element","port":"","host":"","password":"","user":"","userInfo":"","authority":"","protocol":"","source":"/element","queryKey":{},"chunks":["element"]},"urlOriginal":"/session/fdbbae10-42a5-11e4-9d34-d104aa36a721/element"}}
Command duration or timeout: 1.02 seconds
For documentation on this error, please visit: http://seleniumhq.org/exceptions/no_such_element.html
Build info: version: '2.34.0', revision: '11cd0ef93615408e0b6b3bfa28defe125906461a', time: '2013-08-06 11:43:14'
System info: os.name: 'Linux', os.arch: 'amd64', os.version: '3.2.0-60-generic', java.version: '1.6.0_45'
Session ID: fdbbae10-42a5-11e4-9d34-d104aa36a721
Driver info: com.continuuity.test.drivers.CustomPhantomJSDriver
Capabilities [{platform=LINUX, acceptSslCerts=false, javascriptEnabled=true, browserName=phantomjs, rotatable=false, driverVersion=1.1.0, locationContextEnabled=false, version=1.9.7, databaseEnabled=false, cssSelectorsEnabled=true, handlesAlerts=false, browserConnectionEnabled=false, proxy={proxyType=direct}, webStorageEnabled=false, nativeEvents=true, driverName=ghostdriver, applicationCacheEnabled=false, takesScreenshot=true}]
org.openqa.selenium.NoSuchElementException: {"errorMessage":"Unable to find element with css selector '#username'","request":{"headers":{"Accept":"application/json, image/png","Connection":"Keep-Alive","Content-Length":"44","Content-Type":"application/json; charset=utf-8","Host":"localhost:1690"},"httpVersion":"1.1","method":"POST","post":"{\"using\":\"css selector\",\"value\":\"#username\"}","url":"/element","urlParsed":{"anchor":"","query":"","file":"element","directory":"/","path":"/element","relative":"/element","port":"","host":"","password":"","user":"","userInfo":"","authority":"","protocol":"","source":"/element","queryKey":{},"chunks":["element"]},"urlOriginal":"/session/ffb16390-42a5-11e4-8034-ebf1548f0237/element"}}
Command duration or timeout: 1.01 seconds
For documentation on this error, please visit: http://seleniumhq.org/exceptions/no_such_element.html
Build info: version: '2.34.0', revision: '11cd0ef93615408e0b6b3bfa28defe125906461a', time: '2013-08-06 11:43:14'
System info: os.name: 'Linux', os.arch: 'amd64', os.version: '3.2.0-60-generic', java.version: '1.6.0_45'
Session ID: ffb16390-42a5-11e4-8034-ebf1548f0237
Driver info: com.continuuity.test.drivers.CustomPhantomJSDriver
Capabilities [{platform=LINUX, acceptSslCerts=false, javascriptEnabled=true, browserName=phantomjs, rotatable=false, driverVersion=1.1.0, locationContextEnabled=false, version=1.9.7, databaseEnabled=false, cssSelectorsEnabled=true, handlesAlerts=false, browserConnectionEnabled=false, proxy={proxyType=direct}, webStorageEnabled=false, nativeEvents=true, driverName=ghostdriver, applicationCacheEnabled=false, takesScreenshot=true}]
org.openqa.selenium.NoSuchElementException: {"errorMessage":"Unable to find element with css selector '#username'","request":{"headers":{"Accept":"application/json, image/png","Connection":"Keep-Alive","Content-Length":"44","Content-Type":"application/json; charset=utf-8","Host":"localhost:24741"},"httpVersion":"1.1","method":"POST","post":"{\"using\":\"css selector\",\"value\":\"#username\"}","url":"/element","urlParsed":{"anchor":"","query":"","file":"element","directory":"/","path":"/element","relative":"/element","port":"","host":"","password":"","user":"","userInfo":"","authority":"","protocol":"","source":"/element","queryKey":{},"chunks":["element"]},"urlOriginal":"/session/03979e70-42a6-11e4-a97e-d77b7b503497/element"}}
Command duration or timeout: 1.01 seconds
For documentation on this error, please visit: http://seleniumhq.org/exceptions/no_such_element.html
Build info: version: '2.34.0', revision: '11cd0ef93615408e0b6b3bfa28defe125906461a', time: '2013-08-06 11:43:14'
System info: os.name: 'Linux', os.arch: 'amd64', os.version: '3.2.0-60-generic', java.version: '1.6.0_45'
Session ID: 03979e70-42a6-11e4-a97e-d77b7b503497
Driver info: com.continuuity.test.drivers.CustomPhantomJSDriver
Capabilities [{platform=LINUX, acceptSslCerts=false, javascriptEnabled=true, browserName=phantomjs, rotatable=false, driverVersion=1.1.0, locationContextEnabled=false, version=1.9.7, databaseEnabled=false, cssSelectorsEnabled=true, handlesAlerts=false, browserConnectionEnabled=false, proxy={proxyType=direct}, webStorageEnabled=false, nativeEvents=true, driverName=ghostdriver, applicationCacheEnabled=false, takesScreenshot=true}]
org.openqa.selenium.NoSuchElementException: {"errorMessage":"Unable to find element with css selector '#username'","request":{"headers":{"Accept":"application/json, image/png","Connection":"Keep-Alive","Content-Length":"44","Content-Type":"application/json; charset=utf-8","Host":"localhost:15144"},"httpVersion":"1.1","method":"POST","post":"{\"using\":\"css selector\",\"value\":\"#username\"}","url":"/element","urlParsed":{"anchor":"","query":"","file":"element","directory":"/","path":"/element","relative":"/element","port":"","host":"","password":"","user":"","userInfo":"","authority":"","protocol":"","source":"/element","queryKey":{},"chunks":["element"]},"urlOriginal":"/session/01a51d40-42a6-11e4-a157-83d1a6744cc4/element"}}
Command duration or timeout: 1.00 seconds
For documentation on this error, please visit: http://seleniumhq.org/exceptions/no_such_element.html
Build info: version: '2.34.0', revision: '11cd0ef93615408e0b6b3bfa28defe125906461a', time: '2013-08-06 11:43:14'
System info: os.name: 'Linux', os.arch: 'amd64', os.version: '3.2.0-60-generic', java.version: '1.6.0_45'
Session ID: 01a51d40-42a6-11e4-a157-83d1a6744cc4
Driver info: com.continuuity.test.drivers.CustomPhantomJSDriver
Capabilities [{platform=LINUX, acceptSslCerts=false, javascriptEnabled=true, browserName=phantomjs, rotatable=false, driverVersion=1.1.0, locationContextEnabled=false, version=1.9.7, databaseEnabled=false, cssSelectorsEnabled=true, handlesAlerts=false, browserConnectionEnabled=false, proxy={proxyType=direct}, webStorageEnabled=false, nativeEvents=true, driverName=ghostdriver, applicationCacheEnabled=false, takesScreenshot=true}]
org.openqa.selenium.NoSuchElementException: {"errorMessage":"Unable to find element with css selector '#username'","request":{"headers":{"Accept":"application/json, image/png","Connection":"Keep-Alive","Content-Length":"44","Content-Type":"application/json; charset=utf-8","Host":"localhost:5687"},"httpVersion":"1.1","method":"POST","post":"{\"using\":\"css selector\",\"value\":\"#username\"}","url":"/element","urlParsed":{"anchor":"","query":"","file":"element","directory":"/","path":"/element","relative":"/element","port":"","host":"","password":"","user":"","userInfo":"","authority":"","protocol":"","source":"/element","queryKey":{},"chunks":["element"]},"urlOriginal":"/session/058a6dc0-42a6-11e4-b9c6-4d5cf8d19e50/element"}}
Command duration or timeout: 1.03 seconds
For documentation on this error, please visit: http://seleniumhq.org/exceptions/no_such_element.html
Build info: version: '2.34.0', revision: '11cd0ef93615408e0b6b3bfa28defe125906461a', time: '2013-08-06 11:43:14'
System info: os.name: 'Linux', os.arch: 'amd64', os.version: '3.2.0-60-generic', java.version: '1.6.0_45'
Session ID: 058a6dc0-42a6-11e4-b9c6-4d5cf8d19e50
Driver info: com.continuuity.test.drivers.CustomPhantomJSDriver
Capabilities [{platform=LINUX, acceptSslCerts=false, javascriptEnabled=true, browserName=phantomjs, rotatable=false, driverVersion=1.1.0, locationContextEnabled=false, version=1.9.7, databaseEnabled=false, cssSelectorsEnabled=true, handlesAlerts=false, browserConnectionEnabled=false, proxy={proxyType=direct}, webStorageEnabled=false, nativeEvents=true, driverName=ghostdriver, applicationCacheEnabled=false, takesScreenshot=true}]
org.openqa.selenium.NoSuchElementException: {"errorMessage":"Unable to find element with css selector '#username'","request":{"headers":{"Accept":"application/json, image/png","Connection":"Keep-Alive","Content-Length":"44","Content-Type":"application/json; charset=utf-8","Host":"localhost:27701"},"httpVersion":"1.1","method":"POST","post":"{\"using\":\"css selector\",\"value\":\"#username\"}","url":"/element","urlParsed":{"anchor":"","query":"","file":"element","directory":"/","path":"/element","relative":"/element","port":"","host":"","password":"","user":"","userInfo":"","authority":"","protocol":"","source":"/element","queryKey":{},"chunks":["element"]},"urlOriginal":"/session/077f8700-42a6-11e4-8b20-b38d28674a7e/element"}}
Command duration or timeout: 1.04 seconds
For documentation on this error, please visit: http://seleniumhq.org/exceptions/no_such_element.html
Build info: version: '2.34.0', revision: '11cd0ef93615408e0b6b3bfa28defe125906461a', time: '2013-08-06 11:43:14'
System info: os.name: 'Linux', os.arch: 'amd64', os.version: '3.2.0-60-generic', java.version: '1.6.0_45'
Session ID: 077f8700-42a6-11e4-8b20-b38d28674a7e
Driver info: com.continuuity.test.drivers.CustomPhantomJSDriver
Capabilities [{platform=LINUX, acceptSslCerts=false, javascriptEnabled=true, browserName=phantomjs, rotatable=false, driverVersion=1.1.0, locationContextEnabled=false, version=1.9.7, databaseEnabled=false, cssSelectorsEnabled=true, handlesAlerts=false, browserConnectionEnabled=false, proxy={proxyType=direct}, webStorageEnabled=false, nativeEvents=true, driverName=ghostdriver, applicationCacheEnabled=false, takesScreenshot=true}]
org.openqa.selenium.NoSuchElementException: {"errorMessage":"Unable to find element with css selector '#username'","request":{"headers":{"Accept":"application/json, image/png","Connection":"Keep-Alive","Content-Length":"44","Content-Type":"application/json; charset=utf-8","Host":"localhost:11717"},"httpVersion":"1.1","method":"POST","post":"{\"using\":\"css selector\",\"value\":\"#username\"}","url":"/element","urlParsed":{"anchor":"","query":"","file":"element","directory":"/","path":"/element","relative":"/element","port":"","host":"","password":"","user":"","userInfo":"","authority":"","protocol":"","source":"/element","queryKey":{},"chunks":["element"]},"urlOriginal":"/session/09758aa0-42a6-11e4-9b56-1b118e250ff5/element"}}
Command duration or timeout: 1.01 seconds
For documentation on this error, please visit: http://seleniumhq.org/exceptions/no_such_element.html
Build info: version: '2.34.0', revision: '11cd0ef93615408e0b6b3bfa28defe125906461a', time: '2013-08-06 11:43:14'
System info: os.name: 'Linux', os.arch: 'amd64', os.version: '3.2.0-60-generic', java.version: '1.6.0_45'
Session ID: 09758aa0-42a6-11e4-9b56-1b118e250ff5
Driver info: com.continuuity.test.drivers.CustomPhantomJSDriver
Capabilities [{platform=LINUX, acceptSslCerts=false, javascriptEnabled=true, browserName=phantomjs, rotatable=false, driverVersion=1.1.0, locationContextEnabled=false, version=1.9.7, databaseEnabled=false, cssSelectorsEnabled=true, handlesAlerts=false, browserConnectionEnabled=false, proxy={proxyType=direct}, webStorageEnabled=false, nativeEvents=true, driverName=ghostdriver, applicationCacheEnabled=false, takesScreenshot=true}]
org.openqa.selenium.NoSuchElementException: {"errorMessage":"Unable to find element with css selector '#username'","request":{"headers":{"Accept":"application/json, image/png","Connection":"Keep-Alive","Content-Length":"44","Content-Type":"application/json; charset=utf-8","Host":"localhost:27657"},"httpVersion":"1.1","method":"POST","post":"{\"using\":\"css selector\",\"value\":\"#username\"}","url":"/element","urlParsed":{"anchor":"","query":"","file":"element","directory":"/","path":"/element","relative":"/element","port":"","host":"","password":"","user":"","userInfo":"","authority":"","protocol":"","source":"/element","queryKey":{},"chunks":["element"]},"urlOriginal":"/session/0b672170-42a6-11e4-b3bd-69e0649a0fc3/element"}}
Command duration or timeout: 1.04 seconds
For documentation on this error, please visit: http://seleniumhq.org/exceptions/no_such_element.html
Build info: version: '2.34.0', revision: '11cd0ef93615408e0b6b3bfa28defe125906461a', time: '2013-08-06 11:43:14'
System info: os.name: 'Linux', os.arch: 'amd64', os.version: '3.2.0-60-generic', java.version: '1.6.0_45'
Session ID: 0b672170-42a6-11e4-b3bd-69e0649a0fc3
Driver info: com.continuuity.test.drivers.CustomPhantomJSDriver
Capabilities [{platform=LINUX, acceptSslCerts=false, javascriptEnabled=true, browserName=phantomjs, rotatable=false, driverVersion=1.1.0, locationContextEnabled=false, version=1.9.7, databaseEnabled=false, cssSelectorsEnabled=true, handlesAlerts=false, browserConnectionEnabled=false, proxy={proxyType=direct}, webStorageEnabled=false, nativeEvents=true, driverName=ghostdriver, applicationCacheEnabled=false, takesScreenshot=true}]
org.openqa.selenium.NoSuchElementException: {"errorMessage":"Unable to find element with css selector '#username'","request":{"headers":{"Accept":"application/json, image/png","Connection":"Keep-Alive","Content-Length":"44","Content-Type":"application/json; charset=utf-8","Host":"localhost:29325"},"httpVersion":"1.1","method":"POST","post":"{\"using\":\"css selector\",\"value\":\"#username\"}","url":"/element","urlParsed":{"anchor":"","query":"","file":"element","directory":"/","path":"/element","relative":"/element","port":"","host":"","password":"","user":"","userInfo":"","authority":"","protocol":"","source":"/element","queryKey":{},"chunks":["element"]},"urlOriginal":"/session/0d5d4c20-42a6-11e4-aaf9-15cc8dc15867/element"}}
Command duration or timeout: 1.02 seconds
For documentation on this error, please visit: http://seleniumhq.org/exceptions/no_such_element.html
Build info: version: '2.34.0', revision: '11cd0ef93615408e0b6b3bfa28defe125906461a', time: '2013-08-06 11:43:14'
System info: os.name: 'Linux', os.arch: 'amd64', os.version: '3.2.0-60-generic', java.version: '1.6.0_45'
Session ID: 0d5d4c20-42a6-11e4-aaf9-15cc8dc15867
Driver info: com.continuuity.test.drivers.CustomPhantomJSDriver
Capabilities [{platform=LINUX, acceptSslCerts=false, javascriptEnabled=true, browserName=phantomjs, rotatable=false, driverVersion=1.1.0, locationContextEnabled=false, version=1.9.7, databaseEnabled=false, cssSelectorsEnabled=true, handlesAlerts=false, browserConnectionEnabled=false, proxy={proxyType=direct}, webStorageEnabled=false, nativeEvents=true, driverName=ghostdriver, applicationCacheEnabled=false, takesScreenshot=true}]
org.openqa.selenium.NoSuchElementException: {"errorMessage":"Unable to find element with css selector '#username'","request":{"headers":{"Accept":"application/json, image/png","Connection":"Keep-Alive","Content-Length":"44","Content-Type":"application/json; charset=utf-8","Host":"localhost:20016"},"httpVersion":"1.1","method":"POST","post":"{\"using\":\"css selector\",\"value\":\"#username\"}","url":"/element","urlParsed":{"anchor":"","query":"","file":"element","directory":"/","path":"/element","relative":"/element","port":"","host":"","password":"","user":"","userInfo":"","authority":"","protocol":"","source":"/element","queryKey":{},"chunks":["element"]},"urlOriginal":"/session/0f50b7b0-42a6-11e4-8bb1-f595741e880c/element"}}
Command duration or timeout: 1.02 seconds
For documentation on this error, please visit: http://seleniumhq.org/exceptions/no_such_element.html
Build info: version: '2.34.0', revision: '11cd0ef93615408e0b6b3bfa28defe125906461a', time: '2013-08-06 11:43:14'
System info: os.name: 'Linux', os.arch: 'amd64', os.version: '3.2.0-60-generic', java.version: '1.6.0_45'
Session ID: 0f50b7b0-42a6-11e4-8bb1-f595741e880c
Driver info: com.continuuity.test.drivers.CustomPhantomJSDriver
Capabilities [{platform=LINUX, acceptSslCerts=false, javascriptEnabled=true, browserName=phantomjs, rotatable=false, driverVersion=1.1.0, locationContextEnabled=false, version=1.9.7, databaseEnabled=false, cssSelectorsEnabled=true, handlesAlerts=false, browserConnectionEnabled=false, proxy={proxyType=direct}, webStorageEnabled=false, nativeEvents=true, driverName=ghostdriver, applicationCacheEnabled=false, takesScreenshot=true}]
org.openqa.selenium.NoSuchElementException: {"errorMessage":"Unable to find element with css selector '#username'","request":{"headers":{"Accept":"application/json, image/png","Connection":"Keep-Alive","Content-Length":"44","Content-Type":"application/json; charset=utf-8","Host":"localhost:3549"},"httpVersion":"1.1","method":"POST","post":"{\"using\":\"css selector\",\"value\":\"#username\"}","url":"/element","urlParsed":{"anchor":"","query":"","file":"element","directory":"/","path":"/element","relative":"/element","port":"","host":"","password":"","user":"","userInfo":"","authority":"","protocol":"","source":"/element","queryKey":{},"chunks":["element"]},"urlOriginal":"/session/114534b0-42a6-11e4-922c-71fe0cb30080/element"}}
Command duration or timeout: 1.03 seconds
For documentation on this error, please visit: http://seleniumhq.org/exceptions/no_such_element.html
Build info: version: '2.34.0', revision: '11cd0ef93615408e0b6b3bfa28defe125906461a', time: '2013-08-06 11:43:14'
System info: os.name: 'Linux', os.arch: 'amd64', os.version: '3.2.0-60-generic', java.version: '1.6.0_45'
Session ID: 114534b0-42a6-11e4-922c-71fe0cb30080
Driver info: com.continuuity.test.drivers.CustomPhantomJSDriver
Capabilities [{platform=LINUX, acceptSslCerts=false, javascriptEnabled=true, browserName=phantomjs, rotatable=false, driverVersion=1.1.0, locationContextEnabled=false, version=1.9.7, databaseEnabled=false, cssSelectorsEnabled=true, handlesAlerts=false, browserConnectionEnabled=false, proxy={proxyType=direct}, webStorageEnabled=false, nativeEvents=true, driverName=ghostdriver, applicationCacheEnabled=false, takesScreenshot=true}]
org.openqa.selenium.NoSuchElementException: {"errorMessage":"Unable to find element with css selector '#username'","request":{"headers":{"Accept":"application/json, image/png","Connection":"Keep-Alive","Content-Length":"44","Content-Type":"application/json; charset=utf-8","Host":"localhost:32325"},"httpVersion":"1.1","method":"POST","post":"{\"using\":\"css selector\",\"value\":\"#username\"}","url":"/element","urlParsed":{"anchor":"","query":"","file":"element","directory":"/","path":"/element","relative":"/element","port":"","host":"","password":"","user":"","userInfo":"","authority":"","protocol":"","source":"/element","queryKey":{},"chunks":["element"]},"urlOriginal":"/session/1339b1b0-42a6-11e4-8919-e756f8b3ecb9/element"}}
Command duration or timeout: 1.01 seconds
For documentation on this error, please visit: http://seleniumhq.org/exceptions/no_such_element.html
Build info: version: '2.34.0', revision: '11cd0ef93615408e0b6b3bfa28defe125906461a', time: '2013-08-06 11:43:14'
System info: os.name: 'Linux', os.arch: 'amd64', os.version: '3.2.0-60-generic', java.version: '1.6.0_45'
Session ID: 1339b1b0-42a6-11e4-8919-e756f8b3ecb9
Driver info: com.continuuity.test.drivers.CustomPhantomJSDriver
Capabilities [{platform=LINUX, acceptSslCerts=false, javascriptEnabled=true, browserName=phantomjs, rotatable=false, driverVersion=1.1.0, locationContextEnabled=false, version=1.9.7, databaseEnabled=false, cssSelectorsEnabled=true, handlesAlerts=false, browserConnectionEnabled=false, proxy={proxyType=direct}, webStorageEnabled=false, nativeEvents=true, driverName=ghostdriver, applicationCacheEnabled=false, takesScreenshot=true}]
org.openqa.selenium.NoSuchElementException: {"errorMessage":"Unable to find element with css selector '#username'","request":{"headers":{"Accept":"application/json, image/png","Connection":"Keep-Alive","Content-Length":"44","Content-Type":"application/json; charset=utf-8","Host":"localhost:3264"},"httpVersion":"1.1","method":"POST","post":"{\"using\":\"css selector\",\"value\":\"#username\"}","url":"/element","urlParsed":{"anchor":"","query":"","file":"element","directory":"/","path":"/element","relative":"/element","port":"","host":"","password":"","user":"","userInfo":"","authority":"","protocol":"","source":"/element","queryKey":{},"chunks":["element"]},"urlOriginal":"/session/152c59f0-42a6-11e4-84aa-bb8b437eb9e0/element"}}
Command duration or timeout: 1.02 seconds
For documentation on this error, please visit: http://seleniumhq.org/exceptions/no_such_element.html
Build info: version: '2.34.0', revision: '11cd0ef93615408e0b6b3bfa28defe125906461a', time: '2013-08-06 11:43:14'
System info: os.name: 'Linux', os.arch: 'amd64', os.version: '3.2.0-60-generic', java.version: '1.6.0_45'
Session ID: 152c59f0-42a6-11e4-84aa-bb8b437eb9e0
Driver info: com.continuuity.test.drivers.CustomPhantomJSDriver
Capabilities [{platform=LINUX, acceptSslCerts=false, javascriptEnabled=true, browserName=phantomjs, rotatable=false, driverVersion=1.1.0, locationContextEnabled=false, version=1.9.7, databaseEnabled=false, cssSelectorsEnabled=true, handlesAlerts=false, browserConnectionEnabled=false, proxy={proxyType=direct}, webStorageEnabled=false, nativeEvents=true, driverName=ghostdriver, applicationCacheEnabled=false, takesScreenshot=true}]
org.openqa.selenium.NoSuchElementException: {"errorMessage":"Unable to find element with css selector '#username'","request":{"headers":{"Accept":"application/json, image/png","Connection":"Keep-Alive","Content-Length":"44","Content-Type":"application/json; charset=utf-8","Host":"localhost:11308"},"httpVersion":"1.1","method":"POST","post":"{\"using\":\"css selector\",\"value\":\"#username\"}","url":"/element","urlParsed":{"anchor":"","query":"","file":"element","directory":"/","path":"/element","relative":"/element","port":"","host":"","password":"","user":"","userInfo":"","authority":"","protocol":"","source":"/element","queryKey":{},"chunks":["element"]},"urlOriginal":"/session/171f9e70-42a6-11e4-9089-c7ea03ca8500/element"}}
Command duration or timeout: 1.02 seconds
For documentation on this error, please visit: http://seleniumhq.org/exceptions/no_such_element.html
Build info: version: '2.34.0', revision: '11cd0ef93615408e0b6b3bfa28defe125906461a', time: '2013-08-06 11:43:14'
System info: os.name: 'Linux', os.arch: 'amd64', os.version: '3.2.0-60-generic', java.version: '1.6.0_45'
Session ID: 171f9e70-42a6-11e4-9089-c7ea03ca8500
Driver info: com.continuuity.test.drivers.CustomPhantomJSDriver
Capabilities [{platform=LINUX, acceptSslCerts=false, javascriptEnabled=true, browserName=phantomjs, rotatable=false, driverVersion=1.1.0, locationContextEnabled=false, version=1.9.7, databaseEnabled=false, cssSelectorsEnabled=true, handlesAlerts=false, browserConnectionEnabled=false, proxy={proxyType=direct}, webStorageEnabled=false, nativeEvents=true, driverName=ghostdriver, applicationCacheEnabled=false, takesScreenshot=true}]