Clusters with the click

Test results

  • 384 tests in total
  • 16 tests failed
  • 8 minutes taken in total.
Existing test failures 16
Status Test Failing since View job Duration
org.openqa.selenium.NoSuchElementException: {"errorMessage":"Unable to find element with css selector '#username'","request":{"headers":{"Accept":"application/json, image/png","Connection":"Keep-Alive","Content-Length":"44","Content-Type":"application/json; charset=utf-8","Host":"localhost:14977"},"httpVersion":"1.1","method":"POST","post":"{\"using\":\"css selector\",\"value\":\"#username\"}","url":"/element","urlParsed":{"anchor":"","query":"","file":"element","directory":"/","path":"/element","relative":"/element","port":"","host":"","password":"","user":"","userInfo":"","authority":"","protocol":"","source":"/element","queryKey":{},"chunks":["element"]},"urlOriginal":"/session/49bea700-4291-11e4-8968-892f4a7c276d/element"}}
Command duration or timeout: 1.02 seconds
For documentation on this error, please visit: http://seleniumhq.org/exceptions/no_such_element.html
Build info: version: '2.34.0', revision: '11cd0ef93615408e0b6b3bfa28defe125906461a', time: '2013-08-06 11:43:14'
System info: os.name: 'Linux', os.arch: 'amd64', os.version: '3.2.0-60-generic', java.version: '1.6.0_45'
Session ID: 49bea700-4291-11e4-8968-892f4a7c276d
Driver info: com.continuuity.test.drivers.CustomPhantomJSDriver
Capabilities [{platform=LINUX, acceptSslCerts=false, javascriptEnabled=true, browserName=phantomjs, rotatable=false, driverVersion=1.1.0, locationContextEnabled=false, version=1.9.7, databaseEnabled=false, cssSelectorsEnabled=true, handlesAlerts=false, browserConnectionEnabled=false, proxy={proxyType=direct}, webStorageEnabled=false, nativeEvents=true, driverName=ghostdriver, applicationCacheEnabled=false, takesScreenshot=true}]
org.openqa.selenium.NoSuchElementException: {"errorMessage":"Unable to find element with css selector '#username'","request":{"headers":{"Accept":"application/json, image/png","Connection":"Keep-Alive","Content-Length":"44","Content-Type":"application/json; charset=utf-8","Host":"localhost:22410"},"httpVersion":"1.1","method":"POST","post":"{\"using\":\"css selector\",\"value\":\"#username\"}","url":"/element","urlParsed":{"anchor":"","query":"","file":"element","directory":"/","path":"/element","relative":"/element","port":"","host":"","password":"","user":"","userInfo":"","authority":"","protocol":"","source":"/element","queryKey":{},"chunks":["element"]},"urlOriginal":"/session/4bd2b9f0-4291-11e4-b41c-4d35af574787/element"}}
Command duration or timeout: 1.00 seconds
For documentation on this error, please visit: http://seleniumhq.org/exceptions/no_such_element.html
Build info: version: '2.34.0', revision: '11cd0ef93615408e0b6b3bfa28defe125906461a', time: '2013-08-06 11:43:14'
System info: os.name: 'Linux', os.arch: 'amd64', os.version: '3.2.0-60-generic', java.version: '1.6.0_45'
Session ID: 4bd2b9f0-4291-11e4-b41c-4d35af574787
Driver info: com.continuuity.test.drivers.CustomPhantomJSDriver
Capabilities [{platform=LINUX, acceptSslCerts=false, javascriptEnabled=true, browserName=phantomjs, rotatable=false, driverVersion=1.1.0, locationContextEnabled=false, version=1.9.7, databaseEnabled=false, cssSelectorsEnabled=true, handlesAlerts=false, browserConnectionEnabled=false, proxy={proxyType=direct}, webStorageEnabled=false, nativeEvents=true, driverName=ghostdriver, applicationCacheEnabled=false, takesScreenshot=true}]
org.openqa.selenium.NoSuchElementException: {"errorMessage":"Unable to find element with css selector '#username'","request":{"headers":{"Accept":"application/json, image/png","Connection":"Keep-Alive","Content-Length":"44","Content-Type":"application/json; charset=utf-8","Host":"localhost:28174"},"httpVersion":"1.1","method":"POST","post":"{\"using\":\"css selector\",\"value\":\"#username\"}","url":"/element","urlParsed":{"anchor":"","query":"","file":"element","directory":"/","path":"/element","relative":"/element","port":"","host":"","password":"","user":"","userInfo":"","authority":"","protocol":"","source":"/element","queryKey":{},"chunks":["element"]},"urlOriginal":"/session/4de7b740-4291-11e4-ab40-47c4d717ea64/element"}}
Command duration or timeout: 1.01 seconds
For documentation on this error, please visit: http://seleniumhq.org/exceptions/no_such_element.html
Build info: version: '2.34.0', revision: '11cd0ef93615408e0b6b3bfa28defe125906461a', time: '2013-08-06 11:43:14'
System info: os.name: 'Linux', os.arch: 'amd64', os.version: '3.2.0-60-generic', java.version: '1.6.0_45'
Session ID: 4de7b740-4291-11e4-ab40-47c4d717ea64
Driver info: com.continuuity.test.drivers.CustomPhantomJSDriver
Capabilities [{platform=LINUX, acceptSslCerts=false, javascriptEnabled=true, browserName=phantomjs, rotatable=false, driverVersion=1.1.0, locationContextEnabled=false, version=1.9.7, databaseEnabled=false, cssSelectorsEnabled=true, handlesAlerts=false, browserConnectionEnabled=false, proxy={proxyType=direct}, webStorageEnabled=false, nativeEvents=true, driverName=ghostdriver, applicationCacheEnabled=false, takesScreenshot=true}]
org.openqa.selenium.NoSuchElementException: {"errorMessage":"Unable to find element with css selector '#username'","request":{"headers":{"Accept":"application/json, image/png","Connection":"Keep-Alive","Content-Length":"44","Content-Type":"application/json; charset=utf-8","Host":"localhost:9524"},"httpVersion":"1.1","method":"POST","post":"{\"using\":\"css selector\",\"value\":\"#username\"}","url":"/element","urlParsed":{"anchor":"","query":"","file":"element","directory":"/","path":"/element","relative":"/element","port":"","host":"","password":"","user":"","userInfo":"","authority":"","protocol":"","source":"/element","queryKey":{},"chunks":["element"]},"urlOriginal":"/session/4fdafbc0-4291-11e4-bde6-157c25d5b1ab/element"}}
Command duration or timeout: 1.01 seconds
For documentation on this error, please visit: http://seleniumhq.org/exceptions/no_such_element.html
Build info: version: '2.34.0', revision: '11cd0ef93615408e0b6b3bfa28defe125906461a', time: '2013-08-06 11:43:14'
System info: os.name: 'Linux', os.arch: 'amd64', os.version: '3.2.0-60-generic', java.version: '1.6.0_45'
Session ID: 4fdafbc0-4291-11e4-bde6-157c25d5b1ab
Driver info: com.continuuity.test.drivers.CustomPhantomJSDriver
Capabilities [{platform=LINUX, acceptSslCerts=false, javascriptEnabled=true, browserName=phantomjs, rotatable=false, driverVersion=1.1.0, locationContextEnabled=false, version=1.9.7, databaseEnabled=false, cssSelectorsEnabled=true, handlesAlerts=false, browserConnectionEnabled=false, proxy={proxyType=direct}, webStorageEnabled=false, nativeEvents=true, driverName=ghostdriver, applicationCacheEnabled=false, takesScreenshot=true}]
org.openqa.selenium.NoSuchElementException: {"errorMessage":"Unable to find element with css selector '#username'","request":{"headers":{"Accept":"application/json, image/png","Connection":"Keep-Alive","Content-Length":"44","Content-Type":"application/json; charset=utf-8","Host":"localhost:17151"},"httpVersion":"1.1","method":"POST","post":"{\"using\":\"css selector\",\"value\":\"#username\"}","url":"/element","urlParsed":{"anchor":"","query":"","file":"element","directory":"/","path":"/element","relative":"/element","port":"","host":"","password":"","user":"","userInfo":"","authority":"","protocol":"","source":"/element","queryKey":{},"chunks":["element"]},"urlOriginal":"/session/53bf13c0-4291-11e4-861f-2db076f0f6bd/element"}}
Command duration or timeout: 1.04 seconds
For documentation on this error, please visit: http://seleniumhq.org/exceptions/no_such_element.html
Build info: version: '2.34.0', revision: '11cd0ef93615408e0b6b3bfa28defe125906461a', time: '2013-08-06 11:43:14'
System info: os.name: 'Linux', os.arch: 'amd64', os.version: '3.2.0-60-generic', java.version: '1.6.0_45'
Session ID: 53bf13c0-4291-11e4-861f-2db076f0f6bd
Driver info: com.continuuity.test.drivers.CustomPhantomJSDriver
Capabilities [{platform=LINUX, acceptSslCerts=false, javascriptEnabled=true, browserName=phantomjs, rotatable=false, driverVersion=1.1.0, locationContextEnabled=false, version=1.9.7, databaseEnabled=false, cssSelectorsEnabled=true, handlesAlerts=false, browserConnectionEnabled=false, proxy={proxyType=direct}, webStorageEnabled=false, nativeEvents=true, driverName=ghostdriver, applicationCacheEnabled=false, takesScreenshot=true}]
org.openqa.selenium.NoSuchElementException: {"errorMessage":"Unable to find element with css selector '#username'","request":{"headers":{"Accept":"application/json, image/png","Connection":"Keep-Alive","Content-Length":"44","Content-Type":"application/json; charset=utf-8","Host":"localhost:26077"},"httpVersion":"1.1","method":"POST","post":"{\"using\":\"css selector\",\"value\":\"#username\"}","url":"/element","urlParsed":{"anchor":"","query":"","file":"element","directory":"/","path":"/element","relative":"/element","port":"","host":"","password":"","user":"","userInfo":"","authority":"","protocol":"","source":"/element","queryKey":{},"chunks":["element"]},"urlOriginal":"/session/51cce0b0-4291-11e4-ab25-71a325c3ddad/element"}}
Command duration or timeout: 1.00 seconds
For documentation on this error, please visit: http://seleniumhq.org/exceptions/no_such_element.html
Build info: version: '2.34.0', revision: '11cd0ef93615408e0b6b3bfa28defe125906461a', time: '2013-08-06 11:43:14'
System info: os.name: 'Linux', os.arch: 'amd64', os.version: '3.2.0-60-generic', java.version: '1.6.0_45'
Session ID: 51cce0b0-4291-11e4-ab25-71a325c3ddad
Driver info: com.continuuity.test.drivers.CustomPhantomJSDriver
Capabilities [{platform=LINUX, acceptSslCerts=false, javascriptEnabled=true, browserName=phantomjs, rotatable=false, driverVersion=1.1.0, locationContextEnabled=false, version=1.9.7, databaseEnabled=false, cssSelectorsEnabled=true, handlesAlerts=false, browserConnectionEnabled=false, proxy={proxyType=direct}, webStorageEnabled=false, nativeEvents=true, driverName=ghostdriver, applicationCacheEnabled=false, takesScreenshot=true}]
org.openqa.selenium.NoSuchElementException: {"errorMessage":"Unable to find element with css selector '#username'","request":{"headers":{"Accept":"application/json, image/png","Connection":"Keep-Alive","Content-Length":"44","Content-Type":"application/json; charset=utf-8","Host":"localhost:12822"},"httpVersion":"1.1","method":"POST","post":"{\"using\":\"css selector\",\"value\":\"#username\"}","url":"/element","urlParsed":{"anchor":"","query":"","file":"element","directory":"/","path":"/element","relative":"/element","port":"","host":"","password":"","user":"","userInfo":"","authority":"","protocol":"","source":"/element","queryKey":{},"chunks":["element"]},"urlOriginal":"/session/55b56580-4291-11e4-9ec4-4f7f879a7b24/element"}}
Command duration or timeout: 996 milliseconds
For documentation on this error, please visit: http://seleniumhq.org/exceptions/no_such_element.html
Build info: version: '2.34.0', revision: '11cd0ef93615408e0b6b3bfa28defe125906461a', time: '2013-08-06 11:43:14'
System info: os.name: 'Linux', os.arch: 'amd64', os.version: '3.2.0-60-generic', java.version: '1.6.0_45'
Session ID: 55b56580-4291-11e4-9ec4-4f7f879a7b24
Driver info: com.continuuity.test.drivers.CustomPhantomJSDriver
Capabilities [{platform=LINUX, acceptSslCerts=false, javascriptEnabled=true, browserName=phantomjs, rotatable=false, driverVersion=1.1.0, locationContextEnabled=false, version=1.9.7, databaseEnabled=false, cssSelectorsEnabled=true, handlesAlerts=false, browserConnectionEnabled=false, proxy={proxyType=direct}, webStorageEnabled=false, nativeEvents=true, driverName=ghostdriver, applicationCacheEnabled=false, takesScreenshot=true}]
org.openqa.selenium.NoSuchElementException: {"errorMessage":"Unable to find element with css selector '#username'","request":{"headers":{"Accept":"application/json, image/png","Connection":"Keep-Alive","Content-Length":"44","Content-Type":"application/json; charset=utf-8","Host":"localhost:17114"},"httpVersion":"1.1","method":"POST","post":"{\"using\":\"css selector\",\"value\":\"#username\"}","url":"/element","urlParsed":{"anchor":"","query":"","file":"element","directory":"/","path":"/element","relative":"/element","port":"","host":"","password":"","user":"","userInfo":"","authority":"","protocol":"","source":"/element","queryKey":{},"chunks":["element"]},"urlOriginal":"/session/57a66010-4291-11e4-bd1b-5945870a0e81/element"}}
Command duration or timeout: 1.01 seconds
For documentation on this error, please visit: http://seleniumhq.org/exceptions/no_such_element.html
Build info: version: '2.34.0', revision: '11cd0ef93615408e0b6b3bfa28defe125906461a', time: '2013-08-06 11:43:14'
System info: os.name: 'Linux', os.arch: 'amd64', os.version: '3.2.0-60-generic', java.version: '1.6.0_45'
Session ID: 57a66010-4291-11e4-bd1b-5945870a0e81
Driver info: com.continuuity.test.drivers.CustomPhantomJSDriver
Capabilities [{platform=LINUX, acceptSslCerts=false, javascriptEnabled=true, browserName=phantomjs, rotatable=false, driverVersion=1.1.0, locationContextEnabled=false, version=1.9.7, databaseEnabled=false, cssSelectorsEnabled=true, handlesAlerts=false, browserConnectionEnabled=false, proxy={proxyType=direct}, webStorageEnabled=false, nativeEvents=true, driverName=ghostdriver, applicationCacheEnabled=false, takesScreenshot=true}]
org.openqa.selenium.NoSuchElementException: {"errorMessage":"Unable to find element with css selector '#username'","request":{"headers":{"Accept":"application/json, image/png","Connection":"Keep-Alive","Content-Length":"44","Content-Type":"application/json; charset=utf-8","Host":"localhost:12523"},"httpVersion":"1.1","method":"POST","post":"{\"using\":\"css selector\",\"value\":\"#username\"}","url":"/element","urlParsed":{"anchor":"","query":"","file":"element","directory":"/","path":"/element","relative":"/element","port":"","host":"","password":"","user":"","userInfo":"","authority":"","protocol":"","source":"/element","queryKey":{},"chunks":["element"]},"urlOriginal":"/session/599a19c0-4291-11e4-8e37-590b4ea458a5/element"}}
Command duration or timeout: 1.01 seconds
For documentation on this error, please visit: http://seleniumhq.org/exceptions/no_such_element.html
Build info: version: '2.34.0', revision: '11cd0ef93615408e0b6b3bfa28defe125906461a', time: '2013-08-06 11:43:14'
System info: os.name: 'Linux', os.arch: 'amd64', os.version: '3.2.0-60-generic', java.version: '1.6.0_45'
Session ID: 599a19c0-4291-11e4-8e37-590b4ea458a5
Driver info: com.continuuity.test.drivers.CustomPhantomJSDriver
Capabilities [{platform=LINUX, acceptSslCerts=false, javascriptEnabled=true, browserName=phantomjs, rotatable=false, driverVersion=1.1.0, locationContextEnabled=false, version=1.9.7, databaseEnabled=false, cssSelectorsEnabled=true, handlesAlerts=false, browserConnectionEnabled=false, proxy={proxyType=direct}, webStorageEnabled=false, nativeEvents=true, driverName=ghostdriver, applicationCacheEnabled=false, takesScreenshot=true}]
org.openqa.selenium.NoSuchElementException: {"errorMessage":"Unable to find element with css selector '#username'","request":{"headers":{"Accept":"application/json, image/png","Connection":"Keep-Alive","Content-Length":"44","Content-Type":"application/json; charset=utf-8","Host":"localhost:9155"},"httpVersion":"1.1","method":"POST","post":"{\"using\":\"css selector\",\"value\":\"#username\"}","url":"/element","urlParsed":{"anchor":"","query":"","file":"element","directory":"/","path":"/element","relative":"/element","port":"","host":"","password":"","user":"","userInfo":"","authority":"","protocol":"","source":"/element","queryKey":{},"chunks":["element"]},"urlOriginal":"/session/5b8cc200-4291-11e4-8dce-0d16e980a0b8/element"}}
Command duration or timeout: 1.03 seconds
For documentation on this error, please visit: http://seleniumhq.org/exceptions/no_such_element.html
Build info: version: '2.34.0', revision: '11cd0ef93615408e0b6b3bfa28defe125906461a', time: '2013-08-06 11:43:14'
System info: os.name: 'Linux', os.arch: 'amd64', os.version: '3.2.0-60-generic', java.version: '1.6.0_45'
Session ID: 5b8cc200-4291-11e4-8dce-0d16e980a0b8
Driver info: com.continuuity.test.drivers.CustomPhantomJSDriver
Capabilities [{platform=LINUX, acceptSslCerts=false, javascriptEnabled=true, browserName=phantomjs, rotatable=false, driverVersion=1.1.0, locationContextEnabled=false, version=1.9.7, databaseEnabled=false, cssSelectorsEnabled=true, handlesAlerts=false, browserConnectionEnabled=false, proxy={proxyType=direct}, webStorageEnabled=false, nativeEvents=true, driverName=ghostdriver, applicationCacheEnabled=false, takesScreenshot=true}]
org.openqa.selenium.NoSuchElementException: {"errorMessage":"Unable to find element with css selector '#username'","request":{"headers":{"Accept":"application/json, image/png","Connection":"Keep-Alive","Content-Length":"44","Content-Type":"application/json; charset=utf-8","Host":"localhost:14308"},"httpVersion":"1.1","method":"POST","post":"{\"using\":\"css selector\",\"value\":\"#username\"}","url":"/element","urlParsed":{"anchor":"","query":"","file":"element","directory":"/","path":"/element","relative":"/element","port":"","host":"","password":"","user":"","userInfo":"","authority":"","protocol":"","source":"/element","queryKey":{},"chunks":["element"]},"urlOriginal":"/session/5d81b430-4291-11e4-b4c4-e3910945bc16/element"}}
Command duration or timeout: 998 milliseconds
For documentation on this error, please visit: http://seleniumhq.org/exceptions/no_such_element.html
Build info: version: '2.34.0', revision: '11cd0ef93615408e0b6b3bfa28defe125906461a', time: '2013-08-06 11:43:14'
System info: os.name: 'Linux', os.arch: 'amd64', os.version: '3.2.0-60-generic', java.version: '1.6.0_45'
Session ID: 5d81b430-4291-11e4-b4c4-e3910945bc16
Driver info: com.continuuity.test.drivers.CustomPhantomJSDriver
Capabilities [{platform=LINUX, acceptSslCerts=false, javascriptEnabled=true, browserName=phantomjs, rotatable=false, driverVersion=1.1.0, locationContextEnabled=false, version=1.9.7, databaseEnabled=false, cssSelectorsEnabled=true, handlesAlerts=false, browserConnectionEnabled=false, proxy={proxyType=direct}, webStorageEnabled=false, nativeEvents=true, driverName=ghostdriver, applicationCacheEnabled=false, takesScreenshot=true}]
org.openqa.selenium.NoSuchElementException: {"errorMessage":"Unable to find element with css selector '#username'","request":{"headers":{"Accept":"application/json, image/png","Connection":"Keep-Alive","Content-Length":"44","Content-Type":"application/json; charset=utf-8","Host":"localhost:9459"},"httpVersion":"1.1","method":"POST","post":"{\"using\":\"css selector\",\"value\":\"#username\"}","url":"/element","urlParsed":{"anchor":"","query":"","file":"element","directory":"/","path":"/element","relative":"/element","port":"","host":"","password":"","user":"","userInfo":"","authority":"","protocol":"","source":"/element","queryKey":{},"chunks":["element"]},"urlOriginal":"/session/5f7287b0-4291-11e4-bb7b-117805366cd5/element"}}
Command duration or timeout: 1.00 seconds
For documentation on this error, please visit: http://seleniumhq.org/exceptions/no_such_element.html
Build info: version: '2.34.0', revision: '11cd0ef93615408e0b6b3bfa28defe125906461a', time: '2013-08-06 11:43:14'
System info: os.name: 'Linux', os.arch: 'amd64', os.version: '3.2.0-60-generic', java.version: '1.6.0_45'
Session ID: 5f7287b0-4291-11e4-bb7b-117805366cd5
Driver info: com.continuuity.test.drivers.CustomPhantomJSDriver
Capabilities [{platform=LINUX, acceptSslCerts=false, javascriptEnabled=true, browserName=phantomjs, rotatable=false, driverVersion=1.1.0, locationContextEnabled=false, version=1.9.7, databaseEnabled=false, cssSelectorsEnabled=true, handlesAlerts=false, browserConnectionEnabled=false, proxy={proxyType=direct}, webStorageEnabled=false, nativeEvents=true, driverName=ghostdriver, applicationCacheEnabled=false, takesScreenshot=true}]
org.openqa.selenium.NoSuchElementException: {"errorMessage":"Unable to find element with css selector '#username'","request":{"headers":{"Accept":"application/json, image/png","Connection":"Keep-Alive","Content-Length":"44","Content-Type":"application/json; charset=utf-8","Host":"localhost:18196"},"httpVersion":"1.1","method":"POST","post":"{\"using\":\"css selector\",\"value\":\"#username\"}","url":"/element","urlParsed":{"anchor":"","query":"","file":"element","directory":"/","path":"/element","relative":"/element","port":"","host":"","password":"","user":"","userInfo":"","authority":"","protocol":"","source":"/element","queryKey":{},"chunks":["element"]},"urlOriginal":"/session/616493b0-4291-11e4-9695-83932e3d7db7/element"}}
Command duration or timeout: 998 milliseconds
For documentation on this error, please visit: http://seleniumhq.org/exceptions/no_such_element.html
Build info: version: '2.34.0', revision: '11cd0ef93615408e0b6b3bfa28defe125906461a', time: '2013-08-06 11:43:14'
System info: os.name: 'Linux', os.arch: 'amd64', os.version: '3.2.0-60-generic', java.version: '1.6.0_45'
Session ID: 616493b0-4291-11e4-9695-83932e3d7db7
Driver info: com.continuuity.test.drivers.CustomPhantomJSDriver
Capabilities [{platform=LINUX, acceptSslCerts=false, javascriptEnabled=true, browserName=phantomjs, rotatable=false, driverVersion=1.1.0, locationContextEnabled=false, version=1.9.7, databaseEnabled=false, cssSelectorsEnabled=true, handlesAlerts=false, browserConnectionEnabled=false, proxy={proxyType=direct}, webStorageEnabled=false, nativeEvents=true, driverName=ghostdriver, applicationCacheEnabled=false, takesScreenshot=true}]
org.openqa.selenium.NoSuchElementException: {"errorMessage":"Unable to find element with css selector '#username'","request":{"headers":{"Accept":"application/json, image/png","Connection":"Keep-Alive","Content-Length":"44","Content-Type":"application/json; charset=utf-8","Host":"localhost:5756"},"httpVersion":"1.1","method":"POST","post":"{\"using\":\"css selector\",\"value\":\"#username\"}","url":"/element","urlParsed":{"anchor":"","query":"","file":"element","directory":"/","path":"/element","relative":"/element","port":"","host":"","password":"","user":"","userInfo":"","authority":"","protocol":"","source":"/element","queryKey":{},"chunks":["element"]},"urlOriginal":"/session/6354f200-4291-11e4-8873-0db007fef735/element"}}
Command duration or timeout: 998 milliseconds
For documentation on this error, please visit: http://seleniumhq.org/exceptions/no_such_element.html
Build info: version: '2.34.0', revision: '11cd0ef93615408e0b6b3bfa28defe125906461a', time: '2013-08-06 11:43:14'
System info: os.name: 'Linux', os.arch: 'amd64', os.version: '3.2.0-60-generic', java.version: '1.6.0_45'
Session ID: 6354f200-4291-11e4-8873-0db007fef735
Driver info: com.continuuity.test.drivers.CustomPhantomJSDriver
Capabilities [{platform=LINUX, acceptSslCerts=false, javascriptEnabled=true, browserName=phantomjs, rotatable=false, driverVersion=1.1.0, locationContextEnabled=false, version=1.9.7, databaseEnabled=false, cssSelectorsEnabled=true, handlesAlerts=false, browserConnectionEnabled=false, proxy={proxyType=direct}, webStorageEnabled=false, nativeEvents=true, driverName=ghostdriver, applicationCacheEnabled=false, takesScreenshot=true}]
org.openqa.selenium.NoSuchElementException: {"errorMessage":"Unable to find element with css selector '#username'","request":{"headers":{"Accept":"application/json, image/png","Connection":"Keep-Alive","Content-Length":"44","Content-Type":"application/json; charset=utf-8","Host":"localhost:30859"},"httpVersion":"1.1","method":"POST","post":"{\"using\":\"css selector\",\"value\":\"#username\"}","url":"/element","urlParsed":{"anchor":"","query":"","file":"element","directory":"/","path":"/element","relative":"/element","port":"","host":"","password":"","user":"","userInfo":"","authority":"","protocol":"","source":"/element","queryKey":{},"chunks":["element"]},"urlOriginal":"/session/654661c0-4291-11e4-a84f-65036b13b300/element"}}
Command duration or timeout: 1.01 seconds
For documentation on this error, please visit: http://seleniumhq.org/exceptions/no_such_element.html
Build info: version: '2.34.0', revision: '11cd0ef93615408e0b6b3bfa28defe125906461a', time: '2013-08-06 11:43:14'
System info: os.name: 'Linux', os.arch: 'amd64', os.version: '3.2.0-60-generic', java.version: '1.6.0_45'
Session ID: 654661c0-4291-11e4-a84f-65036b13b300
Driver info: com.continuuity.test.drivers.CustomPhantomJSDriver
Capabilities [{platform=LINUX, acceptSslCerts=false, javascriptEnabled=true, browserName=phantomjs, rotatable=false, driverVersion=1.1.0, locationContextEnabled=false, version=1.9.7, databaseEnabled=false, cssSelectorsEnabled=true, handlesAlerts=false, browserConnectionEnabled=false, proxy={proxyType=direct}, webStorageEnabled=false, nativeEvents=true, driverName=ghostdriver, applicationCacheEnabled=false, takesScreenshot=true}]
org.openqa.selenium.NoSuchElementException: {"errorMessage":"Unable to find element with css selector '#username'","request":{"headers":{"Accept":"application/json, image/png","Connection":"Keep-Alive","Content-Length":"44","Content-Type":"application/json; charset=utf-8","Host":"localhost:20781"},"httpVersion":"1.1","method":"POST","post":"{\"using\":\"css selector\",\"value\":\"#username\"}","url":"/element","urlParsed":{"anchor":"","query":"","file":"element","directory":"/","path":"/element","relative":"/element","port":"","host":"","password":"","user":"","userInfo":"","authority":"","protocol":"","source":"/element","queryKey":{},"chunks":["element"]},"urlOriginal":"/session/67393110-4291-11e4-8a4f-55ed88ee71dd/element"}}
Command duration or timeout: 994 milliseconds
For documentation on this error, please visit: http://seleniumhq.org/exceptions/no_such_element.html
Build info: version: '2.34.0', revision: '11cd0ef93615408e0b6b3bfa28defe125906461a', time: '2013-08-06 11:43:14'
System info: os.name: 'Linux', os.arch: 'amd64', os.version: '3.2.0-60-generic', java.version: '1.6.0_45'
Session ID: 67393110-4291-11e4-8a4f-55ed88ee71dd
Driver info: com.continuuity.test.drivers.CustomPhantomJSDriver
Capabilities [{platform=LINUX, acceptSslCerts=false, javascriptEnabled=true, browserName=phantomjs, rotatable=false, driverVersion=1.1.0, locationContextEnabled=false, version=1.9.7, databaseEnabled=false, cssSelectorsEnabled=true, handlesAlerts=false, browserConnectionEnabled=false, proxy={proxyType=direct}, webStorageEnabled=false, nativeEvents=true, driverName=ghostdriver, applicationCacheEnabled=false, takesScreenshot=true}]