Clusters with the click

Build: #5 failed Changes by Chris Gianelloni

Build result summary

Details

Completed
Duration
2 minutes
Labels
None
Agent
Default Agent
Revision
ca6a60cb7eeb3e2b11b5995b58cda851ea3cc2b7 ca6a60cb7eeb3e2b11b5995b58cda851ea3cc2b7
Total tests
384
Failing since
#1 (First build for this plan – )
Fixed in
#14 (Manual run by albert)

Responsible

This build has been failing since #1
No one has taken responsibility

Code commits

Author Commit Message Commit date
Chris Gianelloni Chris Gianelloni ca6a60cb7eeb3e2b11b5995b58cda851ea3cc2b7 ca6a60cb7eeb3e2b11b5995b58cda851ea3cc2b7 Merge pull request #586 from continuuity/feature/no-provider-dns
Feature/no provider dns
Chris Gianelloni Chris Gianelloni 0c9d2eaa40d220d5694d460d96b3f55a1d53b8e9 m 0c9d2eaa40d220d5694d460d96b3f55a1d53b8e9 Do not register AWS default domain

Tests

Existing test failures 16
Status Test Failing since View job Duration
org.openqa.selenium.NoSuchElementException: {"errorMessage":"Unable to find element with css selector '#username'","request":{"headers":{"Accept":"application/json, image/png","Connection":"Keep-Alive","Content-Length":"44","Content-Type":"application/json; charset=utf-8","Host":"localhost:23576"},"httpVersion":"1.1","method":"POST","post":"{\"using\":\"css selector\",\"value\":\"#username\"}","url":"/element","urlParsed":{"anchor":"","query":"","file":"element","directory":"/","path":"/element","relative":"/element","port":"","host":"","password":"","user":"","userInfo":"","authority":"","protocol":"","source":"/element","queryKey":{},"chunks":["element"]},"urlOriginal":"/session/290d3910-428a-11e4-88a9-4993d4052973/element"}}
Command duration or timeout: 1.03 seconds
For documentation on this error, please visit: http://seleniumhq.org/exceptions/no_such_element.html
Build info: version: '2.34.0', revision: '11cd0ef93615408e0b6b3bfa28defe125906461a', time: '2013-08-06 11:43:14'
System info: os.name: 'Linux', os.arch: 'amd64', os.version: '3.2.0-60-generic', java.version: '1.6.0_45'
Session ID: 290d3910-428a-11e4-88a9-4993d4052973
Driver info: com.continuuity.test.drivers.CustomPhantomJSDriver
Capabilities [{platform=LINUX, acceptSslCerts=false, javascriptEnabled=true, browserName=phantomjs, rotatable=false, driverVersion=1.1.0, locationContextEnabled=false, version=1.9.7, databaseEnabled=false, cssSelectorsEnabled=true, handlesAlerts=false, browserConnectionEnabled=false, proxy={proxyType=direct}, webStorageEnabled=false, nativeEvents=true, driverName=ghostdriver, applicationCacheEnabled=false, takesScreenshot=true}]
org.openqa.selenium.NoSuchElementException: {"errorMessage":"Unable to find element with css selector '#username'","request":{"headers":{"Accept":"application/json, image/png","Connection":"Keep-Alive","Content-Length":"44","Content-Type":"application/json; charset=utf-8","Host":"localhost:23975"},"httpVersion":"1.1","method":"POST","post":"{\"using\":\"css selector\",\"value\":\"#username\"}","url":"/element","urlParsed":{"anchor":"","query":"","file":"element","directory":"/","path":"/element","relative":"/element","port":"","host":"","password":"","user":"","userInfo":"","authority":"","protocol":"","source":"/element","queryKey":{},"chunks":["element"]},"urlOriginal":"/session/2b22d2a0-428a-11e4-8169-2d786e92844a/element"}}
Command duration or timeout: 999 milliseconds
For documentation on this error, please visit: http://seleniumhq.org/exceptions/no_such_element.html
Build info: version: '2.34.0', revision: '11cd0ef93615408e0b6b3bfa28defe125906461a', time: '2013-08-06 11:43:14'
System info: os.name: 'Linux', os.arch: 'amd64', os.version: '3.2.0-60-generic', java.version: '1.6.0_45'
Session ID: 2b22d2a0-428a-11e4-8169-2d786e92844a
Driver info: com.continuuity.test.drivers.CustomPhantomJSDriver
Capabilities [{platform=LINUX, acceptSslCerts=false, javascriptEnabled=true, browserName=phantomjs, rotatable=false, driverVersion=1.1.0, locationContextEnabled=false, version=1.9.7, databaseEnabled=false, cssSelectorsEnabled=true, handlesAlerts=false, browserConnectionEnabled=false, proxy={proxyType=direct}, webStorageEnabled=false, nativeEvents=true, driverName=ghostdriver, applicationCacheEnabled=false, takesScreenshot=true}]
org.openqa.selenium.NoSuchElementException: {"errorMessage":"Unable to find element with css selector '#username'","request":{"headers":{"Accept":"application/json, image/png","Connection":"Keep-Alive","Content-Length":"44","Content-Type":"application/json; charset=utf-8","Host":"localhost:27804"},"httpVersion":"1.1","method":"POST","post":"{\"using\":\"css selector\",\"value\":\"#username\"}","url":"/element","urlParsed":{"anchor":"","query":"","file":"element","directory":"/","path":"/element","relative":"/element","port":"","host":"","password":"","user":"","userInfo":"","authority":"","protocol":"","source":"/element","queryKey":{},"chunks":["element"]},"urlOriginal":"/session/2d35ad10-428a-11e4-a031-19743414af78/element"}}
Command duration or timeout: 1.03 seconds
For documentation on this error, please visit: http://seleniumhq.org/exceptions/no_such_element.html
Build info: version: '2.34.0', revision: '11cd0ef93615408e0b6b3bfa28defe125906461a', time: '2013-08-06 11:43:14'
System info: os.name: 'Linux', os.arch: 'amd64', os.version: '3.2.0-60-generic', java.version: '1.6.0_45'
Session ID: 2d35ad10-428a-11e4-a031-19743414af78
Driver info: com.continuuity.test.drivers.CustomPhantomJSDriver
Capabilities [{platform=LINUX, acceptSslCerts=false, javascriptEnabled=true, browserName=phantomjs, rotatable=false, driverVersion=1.1.0, locationContextEnabled=false, version=1.9.7, databaseEnabled=false, cssSelectorsEnabled=true, handlesAlerts=false, browserConnectionEnabled=false, proxy={proxyType=direct}, webStorageEnabled=false, nativeEvents=true, driverName=ghostdriver, applicationCacheEnabled=false, takesScreenshot=true}]
org.openqa.selenium.NoSuchElementException: {"errorMessage":"Unable to find element with css selector '#username'","request":{"headers":{"Accept":"application/json, image/png","Connection":"Keep-Alive","Content-Length":"44","Content-Type":"application/json; charset=utf-8","Host":"localhost:11030"},"httpVersion":"1.1","method":"POST","post":"{\"using\":\"css selector\",\"value\":\"#username\"}","url":"/element","urlParsed":{"anchor":"","query":"","file":"element","directory":"/","path":"/element","relative":"/element","port":"","host":"","password":"","user":"","userInfo":"","authority":"","protocol":"","source":"/element","queryKey":{},"chunks":["element"]},"urlOriginal":"/session/2f2bd7c0-428a-11e4-9109-5171d692fe3b/element"}}
Command duration or timeout: 1.01 seconds
For documentation on this error, please visit: http://seleniumhq.org/exceptions/no_such_element.html
Build info: version: '2.34.0', revision: '11cd0ef93615408e0b6b3bfa28defe125906461a', time: '2013-08-06 11:43:14'
System info: os.name: 'Linux', os.arch: 'amd64', os.version: '3.2.0-60-generic', java.version: '1.6.0_45'
Session ID: 2f2bd7c0-428a-11e4-9109-5171d692fe3b
Driver info: com.continuuity.test.drivers.CustomPhantomJSDriver
Capabilities [{platform=LINUX, acceptSslCerts=false, javascriptEnabled=true, browserName=phantomjs, rotatable=false, driverVersion=1.1.0, locationContextEnabled=false, version=1.9.7, databaseEnabled=false, cssSelectorsEnabled=true, handlesAlerts=false, browserConnectionEnabled=false, proxy={proxyType=direct}, webStorageEnabled=false, nativeEvents=true, driverName=ghostdriver, applicationCacheEnabled=false, takesScreenshot=true}]
org.openqa.selenium.NoSuchElementException: {"errorMessage":"Unable to find element with css selector '#username'","request":{"headers":{"Accept":"application/json, image/png","Connection":"Keep-Alive","Content-Length":"44","Content-Type":"application/json; charset=utf-8","Host":"localhost:30133"},"httpVersion":"1.1","method":"POST","post":"{\"using\":\"css selector\",\"value\":\"#username\"}","url":"/element","urlParsed":{"anchor":"","query":"","file":"element","directory":"/","path":"/element","relative":"/element","port":"","host":"","password":"","user":"","userInfo":"","authority":"","protocol":"","source":"/element","queryKey":{},"chunks":["element"]},"urlOriginal":"/session/33163150-428a-11e4-830e-837880c4727a/element"}}
Command duration or timeout: 1.00 seconds
For documentation on this error, please visit: http://seleniumhq.org/exceptions/no_such_element.html
Build info: version: '2.34.0', revision: '11cd0ef93615408e0b6b3bfa28defe125906461a', time: '2013-08-06 11:43:14'
System info: os.name: 'Linux', os.arch: 'amd64', os.version: '3.2.0-60-generic', java.version: '1.6.0_45'
Session ID: 33163150-428a-11e4-830e-837880c4727a
Driver info: com.continuuity.test.drivers.CustomPhantomJSDriver
Capabilities [{platform=LINUX, acceptSslCerts=false, javascriptEnabled=true, browserName=phantomjs, rotatable=false, driverVersion=1.1.0, locationContextEnabled=false, version=1.9.7, databaseEnabled=false, cssSelectorsEnabled=true, handlesAlerts=false, browserConnectionEnabled=false, proxy={proxyType=direct}, webStorageEnabled=false, nativeEvents=true, driverName=ghostdriver, applicationCacheEnabled=false, takesScreenshot=true}]
org.openqa.selenium.NoSuchElementException: {"errorMessage":"Unable to find element with css selector '#username'","request":{"headers":{"Accept":"application/json, image/png","Connection":"Keep-Alive","Content-Length":"44","Content-Type":"application/json; charset=utf-8","Host":"localhost:6777"},"httpVersion":"1.1","method":"POST","post":"{\"using\":\"css selector\",\"value\":\"#username\"}","url":"/element","urlParsed":{"anchor":"","query":"","file":"element","directory":"/","path":"/element","relative":"/element","port":"","host":"","password":"","user":"","userInfo":"","authority":"","protocol":"","source":"/element","queryKey":{},"chunks":["element"]},"urlOriginal":"/session/311fb880-428a-11e4-b4e1-9bd4ab888ad0/element"}}
Command duration or timeout: 1.03 seconds
For documentation on this error, please visit: http://seleniumhq.org/exceptions/no_such_element.html
Build info: version: '2.34.0', revision: '11cd0ef93615408e0b6b3bfa28defe125906461a', time: '2013-08-06 11:43:14'
System info: os.name: 'Linux', os.arch: 'amd64', os.version: '3.2.0-60-generic', java.version: '1.6.0_45'
Session ID: 311fb880-428a-11e4-b4e1-9bd4ab888ad0
Driver info: com.continuuity.test.drivers.CustomPhantomJSDriver
Capabilities [{platform=LINUX, acceptSslCerts=false, javascriptEnabled=true, browserName=phantomjs, rotatable=false, driverVersion=1.1.0, locationContextEnabled=false, version=1.9.7, databaseEnabled=false, cssSelectorsEnabled=true, handlesAlerts=false, browserConnectionEnabled=false, proxy={proxyType=direct}, webStorageEnabled=false, nativeEvents=true, driverName=ghostdriver, applicationCacheEnabled=false, takesScreenshot=true}]
org.openqa.selenium.NoSuchElementException: {"errorMessage":"Unable to find element with css selector '#username'","request":{"headers":{"Accept":"application/json, image/png","Connection":"Keep-Alive","Content-Length":"44","Content-Type":"application/json; charset=utf-8","Host":"localhost:4488"},"httpVersion":"1.1","method":"POST","post":"{\"using\":\"css selector\",\"value\":\"#username\"}","url":"/element","urlParsed":{"anchor":"","query":"","file":"element","directory":"/","path":"/element","relative":"/element","port":"","host":"","password":"","user":"","userInfo":"","authority":"","protocol":"","source":"/element","queryKey":{},"chunks":["element"]},"urlOriginal":"/session/35083d50-428a-11e4-b6d1-bf872f303ebb/element"}}
Command duration or timeout: 1.01 seconds
For documentation on this error, please visit: http://seleniumhq.org/exceptions/no_such_element.html
Build info: version: '2.34.0', revision: '11cd0ef93615408e0b6b3bfa28defe125906461a', time: '2013-08-06 11:43:14'
System info: os.name: 'Linux', os.arch: 'amd64', os.version: '3.2.0-60-generic', java.version: '1.6.0_45'
Session ID: 35083d50-428a-11e4-b6d1-bf872f303ebb
Driver info: com.continuuity.test.drivers.CustomPhantomJSDriver
Capabilities [{platform=LINUX, acceptSslCerts=false, javascriptEnabled=true, browserName=phantomjs, rotatable=false, driverVersion=1.1.0, locationContextEnabled=false, version=1.9.7, databaseEnabled=false, cssSelectorsEnabled=true, handlesAlerts=false, browserConnectionEnabled=false, proxy={proxyType=direct}, webStorageEnabled=false, nativeEvents=true, driverName=ghostdriver, applicationCacheEnabled=false, takesScreenshot=true}]
org.openqa.selenium.NoSuchElementException: {"errorMessage":"Unable to find element with css selector '#username'","request":{"headers":{"Accept":"application/json, image/png","Connection":"Keep-Alive","Content-Length":"44","Content-Type":"application/json; charset=utf-8","Host":"localhost:25803"},"httpVersion":"1.1","method":"POST","post":"{\"using\":\"css selector\",\"value\":\"#username\"}","url":"/element","urlParsed":{"anchor":"","query":"","file":"element","directory":"/","path":"/element","relative":"/element","port":"","host":"","password":"","user":"","userInfo":"","authority":"","protocol":"","source":"/element","queryKey":{},"chunks":["element"]},"urlOriginal":"/session/36fbcff0-428a-11e4-839b-19625f59faa3/element"}}
Command duration or timeout: 1.00 seconds
For documentation on this error, please visit: http://seleniumhq.org/exceptions/no_such_element.html
Build info: version: '2.34.0', revision: '11cd0ef93615408e0b6b3bfa28defe125906461a', time: '2013-08-06 11:43:14'
System info: os.name: 'Linux', os.arch: 'amd64', os.version: '3.2.0-60-generic', java.version: '1.6.0_45'
Session ID: 36fbcff0-428a-11e4-839b-19625f59faa3
Driver info: com.continuuity.test.drivers.CustomPhantomJSDriver
Capabilities [{platform=LINUX, acceptSslCerts=false, javascriptEnabled=true, browserName=phantomjs, rotatable=false, driverVersion=1.1.0, locationContextEnabled=false, version=1.9.7, databaseEnabled=false, cssSelectorsEnabled=true, handlesAlerts=false, browserConnectionEnabled=false, proxy={proxyType=direct}, webStorageEnabled=false, nativeEvents=true, driverName=ghostdriver, applicationCacheEnabled=false, takesScreenshot=true}]
org.openqa.selenium.NoSuchElementException: {"errorMessage":"Unable to find element with css selector '#username'","request":{"headers":{"Accept":"application/json, image/png","Connection":"Keep-Alive","Content-Length":"44","Content-Type":"application/json; charset=utf-8","Host":"localhost:11049"},"httpVersion":"1.1","method":"POST","post":"{\"using\":\"css selector\",\"value\":\"#username\"}","url":"/element","urlParsed":{"anchor":"","query":"","file":"element","directory":"/","path":"/element","relative":"/element","port":"","host":"","password":"","user":"","userInfo":"","authority":"","protocol":"","source":"/element","queryKey":{},"chunks":["element"]},"urlOriginal":"/session/38eddbf0-428a-11e4-9b43-b7b79ee83cd0/element"}}
Command duration or timeout: 1.01 seconds
For documentation on this error, please visit: http://seleniumhq.org/exceptions/no_such_element.html
Build info: version: '2.34.0', revision: '11cd0ef93615408e0b6b3bfa28defe125906461a', time: '2013-08-06 11:43:14'
System info: os.name: 'Linux', os.arch: 'amd64', os.version: '3.2.0-60-generic', java.version: '1.6.0_45'
Session ID: 38eddbf0-428a-11e4-9b43-b7b79ee83cd0
Driver info: com.continuuity.test.drivers.CustomPhantomJSDriver
Capabilities [{platform=LINUX, acceptSslCerts=false, javascriptEnabled=true, browserName=phantomjs, rotatable=false, driverVersion=1.1.0, locationContextEnabled=false, version=1.9.7, databaseEnabled=false, cssSelectorsEnabled=true, handlesAlerts=false, browserConnectionEnabled=false, proxy={proxyType=direct}, webStorageEnabled=false, nativeEvents=true, driverName=ghostdriver, applicationCacheEnabled=false, takesScreenshot=true}]
org.openqa.selenium.NoSuchElementException: {"errorMessage":"Unable to find element with css selector '#username'","request":{"headers":{"Accept":"application/json, image/png","Connection":"Keep-Alive","Content-Length":"44","Content-Type":"application/json; charset=utf-8","Host":"localhost:19565"},"httpVersion":"1.1","method":"POST","post":"{\"using\":\"css selector\",\"value\":\"#username\"}","url":"/element","urlParsed":{"anchor":"","query":"","file":"element","directory":"/","path":"/element","relative":"/element","port":"","host":"","password":"","user":"","userInfo":"","authority":"","protocol":"","source":"/element","queryKey":{},"chunks":["element"]},"urlOriginal":"/session/3ae03610-428a-11e4-aeaf-9d03298174ec/element"}}
Command duration or timeout: 1.01 seconds
For documentation on this error, please visit: http://seleniumhq.org/exceptions/no_such_element.html
Build info: version: '2.34.0', revision: '11cd0ef93615408e0b6b3bfa28defe125906461a', time: '2013-08-06 11:43:14'
System info: os.name: 'Linux', os.arch: 'amd64', os.version: '3.2.0-60-generic', java.version: '1.6.0_45'
Session ID: 3ae03610-428a-11e4-aeaf-9d03298174ec
Driver info: com.continuuity.test.drivers.CustomPhantomJSDriver
Capabilities [{platform=LINUX, acceptSslCerts=false, javascriptEnabled=true, browserName=phantomjs, rotatable=false, driverVersion=1.1.0, locationContextEnabled=false, version=1.9.7, databaseEnabled=false, cssSelectorsEnabled=true, handlesAlerts=false, browserConnectionEnabled=false, proxy={proxyType=direct}, webStorageEnabled=false, nativeEvents=true, driverName=ghostdriver, applicationCacheEnabled=false, takesScreenshot=true}]
org.openqa.selenium.NoSuchElementException: {"errorMessage":"Unable to find element with css selector '#username'","request":{"headers":{"Accept":"application/json, image/png","Connection":"Keep-Alive","Content-Length":"44","Content-Type":"application/json; charset=utf-8","Host":"localhost:9809"},"httpVersion":"1.1","method":"POST","post":"{\"using\":\"css selector\",\"value\":\"#username\"}","url":"/element","urlParsed":{"anchor":"","query":"","file":"element","directory":"/","path":"/element","relative":"/element","port":"","host":"","password":"","user":"","userInfo":"","authority":"","protocol":"","source":"/element","queryKey":{},"chunks":["element"]},"urlOriginal":"/session/3cd32c70-428a-11e4-a8fa-47c6256fa606/element"}}
Command duration or timeout: 1.02 seconds
For documentation on this error, please visit: http://seleniumhq.org/exceptions/no_such_element.html
Build info: version: '2.34.0', revision: '11cd0ef93615408e0b6b3bfa28defe125906461a', time: '2013-08-06 11:43:14'
System info: os.name: 'Linux', os.arch: 'amd64', os.version: '3.2.0-60-generic', java.version: '1.6.0_45'
Session ID: 3cd32c70-428a-11e4-a8fa-47c6256fa606
Driver info: com.continuuity.test.drivers.CustomPhantomJSDriver
Capabilities [{platform=LINUX, acceptSslCerts=false, javascriptEnabled=true, browserName=phantomjs, rotatable=false, driverVersion=1.1.0, locationContextEnabled=false, version=1.9.7, databaseEnabled=false, cssSelectorsEnabled=true, handlesAlerts=false, browserConnectionEnabled=false, proxy={proxyType=direct}, webStorageEnabled=false, nativeEvents=true, driverName=ghostdriver, applicationCacheEnabled=false, takesScreenshot=true}]
org.openqa.selenium.NoSuchElementException: {"errorMessage":"Unable to find element with css selector '#username'","request":{"headers":{"Accept":"application/json, image/png","Connection":"Keep-Alive","Content-Length":"44","Content-Type":"application/json; charset=utf-8","Host":"localhost:25666"},"httpVersion":"1.1","method":"POST","post":"{\"using\":\"css selector\",\"value\":\"#username\"}","url":"/element","urlParsed":{"anchor":"","query":"","file":"element","directory":"/","path":"/element","relative":"/element","port":"","host":"","password":"","user":"","userInfo":"","authority":"","protocol":"","source":"/element","queryKey":{},"chunks":["element"]},"urlOriginal":"/session/3ec670f0-428a-11e4-8a74-1fd3b1eb19e8/element"}}
Command duration or timeout: 1.01 seconds
For documentation on this error, please visit: http://seleniumhq.org/exceptions/no_such_element.html
Build info: version: '2.34.0', revision: '11cd0ef93615408e0b6b3bfa28defe125906461a', time: '2013-08-06 11:43:14'
System info: os.name: 'Linux', os.arch: 'amd64', os.version: '3.2.0-60-generic', java.version: '1.6.0_45'
Session ID: 3ec670f0-428a-11e4-8a74-1fd3b1eb19e8
Driver info: com.continuuity.test.drivers.CustomPhantomJSDriver
Capabilities [{platform=LINUX, acceptSslCerts=false, javascriptEnabled=true, browserName=phantomjs, rotatable=false, driverVersion=1.1.0, locationContextEnabled=false, version=1.9.7, databaseEnabled=false, cssSelectorsEnabled=true, handlesAlerts=false, browserConnectionEnabled=false, proxy={proxyType=direct}, webStorageEnabled=false, nativeEvents=true, driverName=ghostdriver, applicationCacheEnabled=false, takesScreenshot=true}]
org.openqa.selenium.NoSuchElementException: {"errorMessage":"Unable to find element with css selector '#username'","request":{"headers":{"Accept":"application/json, image/png","Connection":"Keep-Alive","Content-Length":"44","Content-Type":"application/json; charset=utf-8","Host":"localhost:32229"},"httpVersion":"1.1","method":"POST","post":"{\"using\":\"css selector\",\"value\":\"#username\"}","url":"/element","urlParsed":{"anchor":"","query":"","file":"element","directory":"/","path":"/element","relative":"/element","port":"","host":"","password":"","user":"","userInfo":"","authority":"","protocol":"","source":"/element","queryKey":{},"chunks":["element"]},"urlOriginal":"/session/40b8a400-428a-11e4-bc03-8f834513f963/element"}}
Command duration or timeout: 1.02 seconds
For documentation on this error, please visit: http://seleniumhq.org/exceptions/no_such_element.html
Build info: version: '2.34.0', revision: '11cd0ef93615408e0b6b3bfa28defe125906461a', time: '2013-08-06 11:43:14'
System info: os.name: 'Linux', os.arch: 'amd64', os.version: '3.2.0-60-generic', java.version: '1.6.0_45'
Session ID: 40b8a400-428a-11e4-bc03-8f834513f963
Driver info: com.continuuity.test.drivers.CustomPhantomJSDriver
Capabilities [{platform=LINUX, acceptSslCerts=false, javascriptEnabled=true, browserName=phantomjs, rotatable=false, driverVersion=1.1.0, locationContextEnabled=false, version=1.9.7, databaseEnabled=false, cssSelectorsEnabled=true, handlesAlerts=false, browserConnectionEnabled=false, proxy={proxyType=direct}, webStorageEnabled=false, nativeEvents=true, driverName=ghostdriver, applicationCacheEnabled=false, takesScreenshot=true}]
org.openqa.selenium.NoSuchElementException: {"errorMessage":"Unable to find element with css selector '#username'","request":{"headers":{"Accept":"application/json, image/png","Connection":"Keep-Alive","Content-Length":"44","Content-Type":"application/json; charset=utf-8","Host":"localhost:16275"},"httpVersion":"1.1","method":"POST","post":"{\"using\":\"css selector\",\"value\":\"#username\"}","url":"/element","urlParsed":{"anchor":"","query":"","file":"element","directory":"/","path":"/element","relative":"/element","port":"","host":"","password":"","user":"","userInfo":"","authority":"","protocol":"","source":"/element","queryKey":{},"chunks":["element"]},"urlOriginal":"/session/42ac5db0-428a-11e4-b42a-97b80a298df2/element"}}
Command duration or timeout: 996 milliseconds
For documentation on this error, please visit: http://seleniumhq.org/exceptions/no_such_element.html
Build info: version: '2.34.0', revision: '11cd0ef93615408e0b6b3bfa28defe125906461a', time: '2013-08-06 11:43:14'
System info: os.name: 'Linux', os.arch: 'amd64', os.version: '3.2.0-60-generic', java.version: '1.6.0_45'
Session ID: 42ac5db0-428a-11e4-b42a-97b80a298df2
Driver info: com.continuuity.test.drivers.CustomPhantomJSDriver
Capabilities [{platform=LINUX, acceptSslCerts=false, javascriptEnabled=true, browserName=phantomjs, rotatable=false, driverVersion=1.1.0, locationContextEnabled=false, version=1.9.7, databaseEnabled=false, cssSelectorsEnabled=true, handlesAlerts=false, browserConnectionEnabled=false, proxy={proxyType=direct}, webStorageEnabled=false, nativeEvents=true, driverName=ghostdriver, applicationCacheEnabled=false, takesScreenshot=true}]
org.openqa.selenium.NoSuchElementException: {"errorMessage":"Unable to find element with css selector '#username'","request":{"headers":{"Accept":"application/json, image/png","Connection":"Keep-Alive","Content-Length":"44","Content-Type":"application/json; charset=utf-8","Host":"localhost:6538"},"httpVersion":"1.1","method":"POST","post":"{\"using\":\"css selector\",\"value\":\"#username\"}","url":"/element","urlParsed":{"anchor":"","query":"","file":"element","directory":"/","path":"/element","relative":"/element","port":"","host":"","password":"","user":"","userInfo":"","authority":"","protocol":"","source":"/element","queryKey":{},"chunks":["element"]},"urlOriginal":"/session/449c94f0-428a-11e4-b4bd-35b34d9f6844/element"}}
Command duration or timeout: 1.00 seconds
For documentation on this error, please visit: http://seleniumhq.org/exceptions/no_such_element.html
Build info: version: '2.34.0', revision: '11cd0ef93615408e0b6b3bfa28defe125906461a', time: '2013-08-06 11:43:14'
System info: os.name: 'Linux', os.arch: 'amd64', os.version: '3.2.0-60-generic', java.version: '1.6.0_45'
Session ID: 449c94f0-428a-11e4-b4bd-35b34d9f6844
Driver info: com.continuuity.test.drivers.CustomPhantomJSDriver
Capabilities [{platform=LINUX, acceptSslCerts=false, javascriptEnabled=true, browserName=phantomjs, rotatable=false, driverVersion=1.1.0, locationContextEnabled=false, version=1.9.7, databaseEnabled=false, cssSelectorsEnabled=true, handlesAlerts=false, browserConnectionEnabled=false, proxy={proxyType=direct}, webStorageEnabled=false, nativeEvents=true, driverName=ghostdriver, applicationCacheEnabled=false, takesScreenshot=true}]
org.openqa.selenium.NoSuchElementException: {"errorMessage":"Unable to find element with css selector '#username'","request":{"headers":{"Accept":"application/json, image/png","Connection":"Keep-Alive","Content-Length":"44","Content-Type":"application/json; charset=utf-8","Host":"localhost:11137"},"httpVersion":"1.1","method":"POST","post":"{\"using\":\"css selector\",\"value\":\"#username\"}","url":"/element","urlParsed":{"anchor":"","query":"","file":"element","directory":"/","path":"/element","relative":"/element","port":"","host":"","password":"","user":"","userInfo":"","authority":"","protocol":"","source":"/element","queryKey":{},"chunks":["element"]},"urlOriginal":"/session/468d8f80-428a-11e4-94dd-65b9b2a9bcb2/element"}}
Command duration or timeout: 1.03 seconds
For documentation on this error, please visit: http://seleniumhq.org/exceptions/no_such_element.html
Build info: version: '2.34.0', revision: '11cd0ef93615408e0b6b3bfa28defe125906461a', time: '2013-08-06 11:43:14'
System info: os.name: 'Linux', os.arch: 'amd64', os.version: '3.2.0-60-generic', java.version: '1.6.0_45'
Session ID: 468d8f80-428a-11e4-94dd-65b9b2a9bcb2
Driver info: com.continuuity.test.drivers.CustomPhantomJSDriver
Capabilities [{platform=LINUX, acceptSslCerts=false, javascriptEnabled=true, browserName=phantomjs, rotatable=false, driverVersion=1.1.0, locationContextEnabled=false, version=1.9.7, databaseEnabled=false, cssSelectorsEnabled=true, handlesAlerts=false, browserConnectionEnabled=false, proxy={proxyType=direct}, webStorageEnabled=false, nativeEvents=true, driverName=ghostdriver, applicationCacheEnabled=false, takesScreenshot=true}]