Clusters with the click

Test results

  • 422 tests in total
  • 3 tests failed
  • 3 failures are new
  • 7 minutes taken in total.
New test failures 3
Status Test View job Duration
Collapse Failed SynchronizedZKMapTest testConcurrent History
Default Job 30 secs
java.lang.Exception: test timed out after 30000 milliseconds
	at java.lang.Object.wait(Native Method)
	at java.lang.Thread.join(Thread.java:1281)
	at java.lang.Thread.join(Thread.java:1355)
	at co.cask.coopr.common.zookeeper.lib.SynchronizedZKMapTest.testConcurrent(SynchronizedZKMapTest.java:124)
Collapse Failed SchedulerTest testJobPause History
Default Job < 1 sec
java.io.IOException: java.sql.SQLNonTransientConnectionException: No current connection.
	at org.apache.derby.impl.jdbc.SQLExceptionFactory.getSQLException(Unknown Source)
	at org.apache.derby.impl.jdbc.SQLExceptionFactory40.wrapArgsForTransportAcrossDRDA(Unknown Source)
	at org.apache.derby.impl.jdbc.SQLExceptionFactory40.getSQLException(Unknown Source)
	at org.apache.derby.impl.jdbc.Util.newEmbedSQLException(Unknown Source)
	at org.apache.derby.impl.jdbc.Util.newEmbedSQLException(Unknown Source)
	at org.apache.derby.impl.jdbc.Util.noCurrentConnection(Unknown Source)
	at org.apache.derby.impl.jdbc.EmbedConnection.checkIfClosed(Unknown Source)
(52 more lines...)
Collapse Failed SchedulerTest testSuccessCallbacks History
Default Job 21 secs
java.lang.Exception: test timed out after 20000 milliseconds
	at java.net.SocketInputStream.socketRead0(Native Method)
	at java.net.SocketInputStream.read(SocketInputStream.java:152)
	at java.net.SocketInputStream.read(SocketInputStream.java:122)
	at org.apache.http.impl.io.SessionInputBufferImpl.streamRead(SessionInputBufferImpl.java:136)
	at org.apache.http.impl.io.SessionInputBufferImpl.fillBuffer(SessionInputBufferImpl.java:152)
	at org.apache.http.impl.io.SessionInputBufferImpl.readLine(SessionInputBufferImpl.java:270)
	at org.apache.http.impl.conn.DefaultHttpResponseParser.parseHead(DefaultHttpResponseParser.java:140)
(20 more lines...)