Clusters with the click

Build: #3 failed Changes by Nitin Motgi

Build result summary

Details

Completed
Duration
54 minutes
Labels
None
Agent
Default Agent
Revision
2c0698574d0bcdabbac61288d8f340ead6ba9545 2c0698574d0bcdabbac61288d8f340ead6ba9545
Total tests
384
Failing since
#1 (First build for this plan – )
Fixed in
#14 (Manual run by albert)

Responsible

This build has been failing since #1
No one has taken responsibility

Code commits

Author Commit Message Commit date
Nitin Motgi Nitin Motgi 2c0698574d0bcdabbac61288d8f340ead6ba9545 2c0698574d0bcdabbac61288d8f340ead6ba9545 Update README.md

Tests

Existing test failures 16
Status Test Failing since View job Duration
org.openqa.selenium.NoSuchElementException: {"errorMessage":"Unable to find element with css selector '#username'","request":{"headers":{"Accept":"application/json, image/png","Connection":"Keep-Alive","Content-Length":"44","Content-Type":"application/json; charset=utf-8","Host":"localhost:4731"},"httpVersion":"1.1","method":"POST","post":"{\"using\":\"css selector\",\"value\":\"#username\"}","url":"/element","urlParsed":{"anchor":"","query":"","file":"element","directory":"/","path":"/element","relative":"/element","port":"","host":"","password":"","user":"","userInfo":"","authority":"","protocol":"","source":"/element","queryKey":{},"chunks":["element"]},"urlOriginal":"/session/2db9bb50-41f4-11e4-bfd5-2b16b995dbb9/element"}}
Command duration or timeout: 1.03 seconds
For documentation on this error, please visit: http://seleniumhq.org/exceptions/no_such_element.html
Build info: version: '2.34.0', revision: '11cd0ef93615408e0b6b3bfa28defe125906461a', time: '2013-08-06 11:43:14'
System info: os.name: 'Linux', os.arch: 'amd64', os.version: '3.2.0-60-generic', java.version: '1.6.0_45'
Session ID: 2db9bb50-41f4-11e4-bfd5-2b16b995dbb9
Driver info: com.continuuity.test.drivers.CustomPhantomJSDriver
Capabilities [{platform=LINUX, acceptSslCerts=false, javascriptEnabled=true, browserName=phantomjs, rotatable=false, driverVersion=1.1.0, locationContextEnabled=false, version=1.9.7, databaseEnabled=false, cssSelectorsEnabled=true, handlesAlerts=false, browserConnectionEnabled=false, proxy={proxyType=direct}, webStorageEnabled=false, nativeEvents=true, driverName=ghostdriver, applicationCacheEnabled=false, takesScreenshot=true}]
org.openqa.selenium.NoSuchElementException: {"errorMessage":"Unable to find element with css selector '#username'","request":{"headers":{"Accept":"application/json, image/png","Connection":"Keep-Alive","Content-Length":"44","Content-Type":"application/json; charset=utf-8","Host":"localhost:18488"},"httpVersion":"1.1","method":"POST","post":"{\"using\":\"css selector\",\"value\":\"#username\"}","url":"/element","urlParsed":{"anchor":"","query":"","file":"element","directory":"/","path":"/element","relative":"/element","port":"","host":"","password":"","user":"","userInfo":"","authority":"","protocol":"","source":"/element","queryKey":{},"chunks":["element"]},"urlOriginal":"/session/2fd85590-41f4-11e4-bd70-a59221c507da/element"}}
Command duration or timeout: 1.03 seconds
For documentation on this error, please visit: http://seleniumhq.org/exceptions/no_such_element.html
Build info: version: '2.34.0', revision: '11cd0ef93615408e0b6b3bfa28defe125906461a', time: '2013-08-06 11:43:14'
System info: os.name: 'Linux', os.arch: 'amd64', os.version: '3.2.0-60-generic', java.version: '1.6.0_45'
Session ID: 2fd85590-41f4-11e4-bd70-a59221c507da
Driver info: com.continuuity.test.drivers.CustomPhantomJSDriver
Capabilities [{platform=LINUX, acceptSslCerts=false, javascriptEnabled=true, browserName=phantomjs, rotatable=false, driverVersion=1.1.0, locationContextEnabled=false, version=1.9.7, databaseEnabled=false, cssSelectorsEnabled=true, handlesAlerts=false, browserConnectionEnabled=false, proxy={proxyType=direct}, webStorageEnabled=false, nativeEvents=true, driverName=ghostdriver, applicationCacheEnabled=false, takesScreenshot=true}]
org.openqa.selenium.NoSuchElementException: {"errorMessage":"Unable to find element with css selector '#username'","request":{"headers":{"Accept":"application/json, image/png","Connection":"Keep-Alive","Content-Length":"44","Content-Type":"application/json; charset=utf-8","Host":"localhost:4897"},"httpVersion":"1.1","method":"POST","post":"{\"using\":\"css selector\",\"value\":\"#username\"}","url":"/element","urlParsed":{"anchor":"","query":"","file":"element","directory":"/","path":"/element","relative":"/element","port":"","host":"","password":"","user":"","userInfo":"","authority":"","protocol":"","source":"/element","queryKey":{},"chunks":["element"]},"urlOriginal":"/session/31f12370-41f4-11e4-bc29-bd0440dbc200/element"}}
Command duration or timeout: 1.02 seconds
For documentation on this error, please visit: http://seleniumhq.org/exceptions/no_such_element.html
Build info: version: '2.34.0', revision: '11cd0ef93615408e0b6b3bfa28defe125906461a', time: '2013-08-06 11:43:14'
System info: os.name: 'Linux', os.arch: 'amd64', os.version: '3.2.0-60-generic', java.version: '1.6.0_45'
Session ID: 31f12370-41f4-11e4-bc29-bd0440dbc200
Driver info: com.continuuity.test.drivers.CustomPhantomJSDriver
Capabilities [{platform=LINUX, acceptSslCerts=false, javascriptEnabled=true, browserName=phantomjs, rotatable=false, driverVersion=1.1.0, locationContextEnabled=false, version=1.9.7, databaseEnabled=false, cssSelectorsEnabled=true, handlesAlerts=false, browserConnectionEnabled=false, proxy={proxyType=direct}, webStorageEnabled=false, nativeEvents=true, driverName=ghostdriver, applicationCacheEnabled=false, takesScreenshot=true}]
org.openqa.selenium.NoSuchElementException: {"errorMessage":"Unable to find element with css selector '#username'","request":{"headers":{"Accept":"application/json, image/png","Connection":"Keep-Alive","Content-Length":"44","Content-Type":"application/json; charset=utf-8","Host":"localhost:27268"},"httpVersion":"1.1","method":"POST","post":"{\"using\":\"css selector\",\"value\":\"#username\"}","url":"/element","urlParsed":{"anchor":"","query":"","file":"element","directory":"/","path":"/element","relative":"/element","port":"","host":"","password":"","user":"","userInfo":"","authority":"","protocol":"","source":"/element","queryKey":{},"chunks":["element"]},"urlOriginal":"/session/33e57960-41f4-11e4-97ef-2b34de5232c6/element"}}
Command duration or timeout: 1.01 seconds
For documentation on this error, please visit: http://seleniumhq.org/exceptions/no_such_element.html
Build info: version: '2.34.0', revision: '11cd0ef93615408e0b6b3bfa28defe125906461a', time: '2013-08-06 11:43:14'
System info: os.name: 'Linux', os.arch: 'amd64', os.version: '3.2.0-60-generic', java.version: '1.6.0_45'
Session ID: 33e57960-41f4-11e4-97ef-2b34de5232c6
Driver info: com.continuuity.test.drivers.CustomPhantomJSDriver
Capabilities [{platform=LINUX, acceptSslCerts=false, javascriptEnabled=true, browserName=phantomjs, rotatable=false, driverVersion=1.1.0, locationContextEnabled=false, version=1.9.7, databaseEnabled=false, cssSelectorsEnabled=true, handlesAlerts=false, browserConnectionEnabled=false, proxy={proxyType=direct}, webStorageEnabled=false, nativeEvents=true, driverName=ghostdriver, applicationCacheEnabled=false, takesScreenshot=true}]
org.openqa.selenium.NoSuchElementException: {"errorMessage":"Unable to find element with css selector '#username'","request":{"headers":{"Accept":"application/json, image/png","Connection":"Keep-Alive","Content-Length":"44","Content-Type":"application/json; charset=utf-8","Host":"localhost:13521"},"httpVersion":"1.1","method":"POST","post":"{\"using\":\"css selector\",\"value\":\"#username\"}","url":"/element","urlParsed":{"anchor":"","query":"","file":"element","directory":"/","path":"/element","relative":"/element","port":"","host":"","password":"","user":"","userInfo":"","authority":"","protocol":"","source":"/element","queryKey":{},"chunks":["element"]},"urlOriginal":"/session/37cf5dc0-41f4-11e4-a185-1f19883d9b91/element"}}
Command duration or timeout: 1.01 seconds
For documentation on this error, please visit: http://seleniumhq.org/exceptions/no_such_element.html
Build info: version: '2.34.0', revision: '11cd0ef93615408e0b6b3bfa28defe125906461a', time: '2013-08-06 11:43:14'
System info: os.name: 'Linux', os.arch: 'amd64', os.version: '3.2.0-60-generic', java.version: '1.6.0_45'
Session ID: 37cf5dc0-41f4-11e4-a185-1f19883d9b91
Driver info: com.continuuity.test.drivers.CustomPhantomJSDriver
Capabilities [{platform=LINUX, acceptSslCerts=false, javascriptEnabled=true, browserName=phantomjs, rotatable=false, driverVersion=1.1.0, locationContextEnabled=false, version=1.9.7, databaseEnabled=false, cssSelectorsEnabled=true, handlesAlerts=false, browserConnectionEnabled=false, proxy={proxyType=direct}, webStorageEnabled=false, nativeEvents=true, driverName=ghostdriver, applicationCacheEnabled=false, takesScreenshot=true}]
org.openqa.selenium.NoSuchElementException: {"errorMessage":"Unable to find element with css selector '#username'","request":{"headers":{"Accept":"application/json, image/png","Connection":"Keep-Alive","Content-Length":"44","Content-Type":"application/json; charset=utf-8","Host":"localhost:17913"},"httpVersion":"1.1","method":"POST","post":"{\"using\":\"css selector\",\"value\":\"#username\"}","url":"/element","urlParsed":{"anchor":"","query":"","file":"element","directory":"/","path":"/element","relative":"/element","port":"","host":"","password":"","user":"","userInfo":"","authority":"","protocol":"","source":"/element","queryKey":{},"chunks":["element"]},"urlOriginal":"/session/35d9a840-41f4-11e4-8dc2-090691db19b6/element"}}
Command duration or timeout: 1.02 seconds
For documentation on this error, please visit: http://seleniumhq.org/exceptions/no_such_element.html
Build info: version: '2.34.0', revision: '11cd0ef93615408e0b6b3bfa28defe125906461a', time: '2013-08-06 11:43:14'
System info: os.name: 'Linux', os.arch: 'amd64', os.version: '3.2.0-60-generic', java.version: '1.6.0_45'
Session ID: 35d9a840-41f4-11e4-8dc2-090691db19b6
Driver info: com.continuuity.test.drivers.CustomPhantomJSDriver
Capabilities [{platform=LINUX, acceptSslCerts=false, javascriptEnabled=true, browserName=phantomjs, rotatable=false, driverVersion=1.1.0, locationContextEnabled=false, version=1.9.7, databaseEnabled=false, cssSelectorsEnabled=true, handlesAlerts=false, browserConnectionEnabled=false, proxy={proxyType=direct}, webStorageEnabled=false, nativeEvents=true, driverName=ghostdriver, applicationCacheEnabled=false, takesScreenshot=true}]
org.openqa.selenium.NoSuchElementException: {"errorMessage":"Unable to find element with css selector '#username'","request":{"headers":{"Accept":"application/json, image/png","Connection":"Keep-Alive","Content-Length":"44","Content-Type":"application/json; charset=utf-8","Host":"localhost:30820"},"httpVersion":"1.1","method":"POST","post":"{\"using\":\"css selector\",\"value\":\"#username\"}","url":"/element","urlParsed":{"anchor":"","query":"","file":"element","directory":"/","path":"/element","relative":"/element","port":"","host":"","password":"","user":"","userInfo":"","authority":"","protocol":"","source":"/element","queryKey":{},"chunks":["element"]},"urlOriginal":"/session/39c25420-41f4-11e4-9cab-87fa9c6c071a/element"}}
Command duration or timeout: 1.02 seconds
For documentation on this error, please visit: http://seleniumhq.org/exceptions/no_such_element.html
Build info: version: '2.34.0', revision: '11cd0ef93615408e0b6b3bfa28defe125906461a', time: '2013-08-06 11:43:14'
System info: os.name: 'Linux', os.arch: 'amd64', os.version: '3.2.0-60-generic', java.version: '1.6.0_45'
Session ID: 39c25420-41f4-11e4-9cab-87fa9c6c071a
Driver info: com.continuuity.test.drivers.CustomPhantomJSDriver
Capabilities [{platform=LINUX, acceptSslCerts=false, javascriptEnabled=true, browserName=phantomjs, rotatable=false, driverVersion=1.1.0, locationContextEnabled=false, version=1.9.7, databaseEnabled=false, cssSelectorsEnabled=true, handlesAlerts=false, browserConnectionEnabled=false, proxy={proxyType=direct}, webStorageEnabled=false, nativeEvents=true, driverName=ghostdriver, applicationCacheEnabled=false, takesScreenshot=true}]
org.openqa.selenium.NoSuchElementException: {"errorMessage":"Unable to find element with css selector '#username'","request":{"headers":{"Accept":"application/json, image/png","Connection":"Keep-Alive","Content-Length":"44","Content-Type":"application/json; charset=utf-8","Host":"localhost:5744"},"httpVersion":"1.1","method":"POST","post":"{\"using\":\"css selector\",\"value\":\"#username\"}","url":"/element","urlParsed":{"anchor":"","query":"","file":"element","directory":"/","path":"/element","relative":"/element","port":"","host":"","password":"","user":"","userInfo":"","authority":"","protocol":"","source":"/element","queryKey":{},"chunks":["element"]},"urlOriginal":"/session/3bb74650-41f4-11e4-8a35-a9c5e6007b44/element"}}
Command duration or timeout: 1.01 seconds
For documentation on this error, please visit: http://seleniumhq.org/exceptions/no_such_element.html
Build info: version: '2.34.0', revision: '11cd0ef93615408e0b6b3bfa28defe125906461a', time: '2013-08-06 11:43:14'
System info: os.name: 'Linux', os.arch: 'amd64', os.version: '3.2.0-60-generic', java.version: '1.6.0_45'
Session ID: 3bb74650-41f4-11e4-8a35-a9c5e6007b44
Driver info: com.continuuity.test.drivers.CustomPhantomJSDriver
Capabilities [{platform=LINUX, acceptSslCerts=false, javascriptEnabled=true, browserName=phantomjs, rotatable=false, driverVersion=1.1.0, locationContextEnabled=false, version=1.9.7, databaseEnabled=false, cssSelectorsEnabled=true, handlesAlerts=false, browserConnectionEnabled=false, proxy={proxyType=direct}, webStorageEnabled=false, nativeEvents=true, driverName=ghostdriver, applicationCacheEnabled=false, takesScreenshot=true}]
org.openqa.selenium.NoSuchElementException: {"errorMessage":"Unable to find element with css selector '#username'","request":{"headers":{"Accept":"application/json, image/png","Connection":"Keep-Alive","Content-Length":"44","Content-Type":"application/json; charset=utf-8","Host":"localhost:11343"},"httpVersion":"1.1","method":"POST","post":"{\"using\":\"css selector\",\"value\":\"#username\"}","url":"/element","urlParsed":{"anchor":"","query":"","file":"element","directory":"/","path":"/element","relative":"/element","port":"","host":"","password":"","user":"","userInfo":"","authority":"","protocol":"","source":"/element","queryKey":{},"chunks":["element"]},"urlOriginal":"/session/3daa15a0-41f4-11e4-8b21-87e3eef882dc/element"}}
Command duration or timeout: 1.02 seconds
For documentation on this error, please visit: http://seleniumhq.org/exceptions/no_such_element.html
Build info: version: '2.34.0', revision: '11cd0ef93615408e0b6b3bfa28defe125906461a', time: '2013-08-06 11:43:14'
System info: os.name: 'Linux', os.arch: 'amd64', os.version: '3.2.0-60-generic', java.version: '1.6.0_45'
Session ID: 3daa15a0-41f4-11e4-8b21-87e3eef882dc
Driver info: com.continuuity.test.drivers.CustomPhantomJSDriver
Capabilities [{platform=LINUX, acceptSslCerts=false, javascriptEnabled=true, browserName=phantomjs, rotatable=false, driverVersion=1.1.0, locationContextEnabled=false, version=1.9.7, databaseEnabled=false, cssSelectorsEnabled=true, handlesAlerts=false, browserConnectionEnabled=false, proxy={proxyType=direct}, webStorageEnabled=false, nativeEvents=true, driverName=ghostdriver, applicationCacheEnabled=false, takesScreenshot=true}]
org.openqa.selenium.NoSuchElementException: {"errorMessage":"Unable to find element with css selector '#username'","request":{"headers":{"Accept":"application/json, image/png","Connection":"Keep-Alive","Content-Length":"44","Content-Type":"application/json; charset=utf-8","Host":"localhost:3113"},"httpVersion":"1.1","method":"POST","post":"{\"using\":\"css selector\",\"value\":\"#username\"}","url":"/element","urlParsed":{"anchor":"","query":"","file":"element","directory":"/","path":"/element","relative":"/element","port":"","host":"","password":"","user":"","userInfo":"","authority":"","protocol":"","source":"/element","queryKey":{},"chunks":["element"]},"urlOriginal":"/session/3f9da840-41f4-11e4-a13d-73c387fef2c8/element"}}
Command duration or timeout: 1.03 seconds
For documentation on this error, please visit: http://seleniumhq.org/exceptions/no_such_element.html
Build info: version: '2.34.0', revision: '11cd0ef93615408e0b6b3bfa28defe125906461a', time: '2013-08-06 11:43:14'
System info: os.name: 'Linux', os.arch: 'amd64', os.version: '3.2.0-60-generic', java.version: '1.6.0_45'
Session ID: 3f9da840-41f4-11e4-a13d-73c387fef2c8
Driver info: com.continuuity.test.drivers.CustomPhantomJSDriver
Capabilities [{platform=LINUX, acceptSslCerts=false, javascriptEnabled=true, browserName=phantomjs, rotatable=false, driverVersion=1.1.0, locationContextEnabled=false, version=1.9.7, databaseEnabled=false, cssSelectorsEnabled=true, handlesAlerts=false, browserConnectionEnabled=false, proxy={proxyType=direct}, webStorageEnabled=false, nativeEvents=true, driverName=ghostdriver, applicationCacheEnabled=false, takesScreenshot=true}]
org.openqa.selenium.NoSuchElementException: {"errorMessage":"Unable to find element with css selector '#username'","request":{"headers":{"Accept":"application/json, image/png","Connection":"Keep-Alive","Content-Length":"44","Content-Type":"application/json; charset=utf-8","Host":"localhost:18711"},"httpVersion":"1.1","method":"POST","post":"{\"using\":\"css selector\",\"value\":\"#username\"}","url":"/element","urlParsed":{"anchor":"","query":"","file":"element","directory":"/","path":"/element","relative":"/element","port":"","host":"","password":"","user":"","userInfo":"","authority":"","protocol":"","source":"/element","queryKey":{},"chunks":["element"]},"urlOriginal":"/session/41930fa0-41f4-11e4-8e9f-1d2761461585/element"}}
Command duration or timeout: 1.01 seconds
For documentation on this error, please visit: http://seleniumhq.org/exceptions/no_such_element.html
Build info: version: '2.34.0', revision: '11cd0ef93615408e0b6b3bfa28defe125906461a', time: '2013-08-06 11:43:14'
System info: os.name: 'Linux', os.arch: 'amd64', os.version: '3.2.0-60-generic', java.version: '1.6.0_45'
Session ID: 41930fa0-41f4-11e4-8e9f-1d2761461585
Driver info: com.continuuity.test.drivers.CustomPhantomJSDriver
Capabilities [{platform=LINUX, acceptSslCerts=false, javascriptEnabled=true, browserName=phantomjs, rotatable=false, driverVersion=1.1.0, locationContextEnabled=false, version=1.9.7, databaseEnabled=false, cssSelectorsEnabled=true, handlesAlerts=false, browserConnectionEnabled=false, proxy={proxyType=direct}, webStorageEnabled=false, nativeEvents=true, driverName=ghostdriver, applicationCacheEnabled=false, takesScreenshot=true}]
org.openqa.selenium.NoSuchElementException: {"errorMessage":"Unable to find element with css selector '#username'","request":{"headers":{"Accept":"application/json, image/png","Connection":"Keep-Alive","Content-Length":"44","Content-Type":"application/json; charset=utf-8","Host":"localhost:18915"},"httpVersion":"1.1","method":"POST","post":"{\"using\":\"css selector\",\"value\":\"#username\"}","url":"/element","urlParsed":{"anchor":"","query":"","file":"element","directory":"/","path":"/element","relative":"/element","port":"","host":"","password":"","user":"","userInfo":"","authority":"","protocol":"","source":"/element","queryKey":{},"chunks":["element"]},"urlOriginal":"/session/4385def0-41f4-11e4-8f2f-cbc482c5f67e/element"}}
Command duration or timeout: 1.00 seconds
For documentation on this error, please visit: http://seleniumhq.org/exceptions/no_such_element.html
Build info: version: '2.34.0', revision: '11cd0ef93615408e0b6b3bfa28defe125906461a', time: '2013-08-06 11:43:14'
System info: os.name: 'Linux', os.arch: 'amd64', os.version: '3.2.0-60-generic', java.version: '1.6.0_45'
Session ID: 4385def0-41f4-11e4-8f2f-cbc482c5f67e
Driver info: com.continuuity.test.drivers.CustomPhantomJSDriver
Capabilities [{platform=LINUX, acceptSslCerts=false, javascriptEnabled=true, browserName=phantomjs, rotatable=false, driverVersion=1.1.0, locationContextEnabled=false, version=1.9.7, databaseEnabled=false, cssSelectorsEnabled=true, handlesAlerts=false, browserConnectionEnabled=false, proxy={proxyType=direct}, webStorageEnabled=false, nativeEvents=true, driverName=ghostdriver, applicationCacheEnabled=false, takesScreenshot=true}]
org.openqa.selenium.NoSuchElementException: {"errorMessage":"Unable to find element with css selector '#username'","request":{"headers":{"Accept":"application/json, image/png","Connection":"Keep-Alive","Content-Length":"44","Content-Type":"application/json; charset=utf-8","Host":"localhost:14420"},"httpVersion":"1.1","method":"POST","post":"{\"using\":\"css selector\",\"value\":\"#username\"}","url":"/element","urlParsed":{"anchor":"","query":"","file":"element","directory":"/","path":"/element","relative":"/element","port":"","host":"","password":"","user":"","userInfo":"","authority":"","protocol":"","source":"/element","queryKey":{},"chunks":["element"]},"urlOriginal":"/session/457727a0-41f4-11e4-b101-85cfe66fecca/element"}}
Command duration or timeout: 1.03 seconds
For documentation on this error, please visit: http://seleniumhq.org/exceptions/no_such_element.html
Build info: version: '2.34.0', revision: '11cd0ef93615408e0b6b3bfa28defe125906461a', time: '2013-08-06 11:43:14'
System info: os.name: 'Linux', os.arch: 'amd64', os.version: '3.2.0-60-generic', java.version: '1.6.0_45'
Session ID: 457727a0-41f4-11e4-b101-85cfe66fecca
Driver info: com.continuuity.test.drivers.CustomPhantomJSDriver
Capabilities [{platform=LINUX, acceptSslCerts=false, javascriptEnabled=true, browserName=phantomjs, rotatable=false, driverVersion=1.1.0, locationContextEnabled=false, version=1.9.7, databaseEnabled=false, cssSelectorsEnabled=true, handlesAlerts=false, browserConnectionEnabled=false, proxy={proxyType=direct}, webStorageEnabled=false, nativeEvents=true, driverName=ghostdriver, applicationCacheEnabled=false, takesScreenshot=true}]
org.openqa.selenium.NoSuchElementException: {"errorMessage":"Unable to find element with css selector '#username'","request":{"headers":{"Accept":"application/json, image/png","Connection":"Keep-Alive","Content-Length":"44","Content-Type":"application/json; charset=utf-8","Host":"localhost:24250"},"httpVersion":"1.1","method":"POST","post":"{\"using\":\"css selector\",\"value\":\"#username\"}","url":"/element","urlParsed":{"anchor":"","query":"","file":"element","directory":"/","path":"/element","relative":"/element","port":"","host":"","password":"","user":"","userInfo":"","authority":"","protocol":"","source":"/element","queryKey":{},"chunks":["element"]},"urlOriginal":"/session/476d0430-41f4-11e4-9472-17634f2d0749/element"}}
Command duration or timeout: 1.00 seconds
For documentation on this error, please visit: http://seleniumhq.org/exceptions/no_such_element.html
Build info: version: '2.34.0', revision: '11cd0ef93615408e0b6b3bfa28defe125906461a', time: '2013-08-06 11:43:14'
System info: os.name: 'Linux', os.arch: 'amd64', os.version: '3.2.0-60-generic', java.version: '1.6.0_45'
Session ID: 476d0430-41f4-11e4-9472-17634f2d0749
Driver info: com.continuuity.test.drivers.CustomPhantomJSDriver
Capabilities [{platform=LINUX, acceptSslCerts=false, javascriptEnabled=true, browserName=phantomjs, rotatable=false, driverVersion=1.1.0, locationContextEnabled=false, version=1.9.7, databaseEnabled=false, cssSelectorsEnabled=true, handlesAlerts=false, browserConnectionEnabled=false, proxy={proxyType=direct}, webStorageEnabled=false, nativeEvents=true, driverName=ghostdriver, applicationCacheEnabled=false, takesScreenshot=true}]
org.openqa.selenium.NoSuchElementException: {"errorMessage":"Unable to find element with css selector '#username'","request":{"headers":{"Accept":"application/json, image/png","Connection":"Keep-Alive","Content-Length":"44","Content-Type":"application/json; charset=utf-8","Host":"localhost:26764"},"httpVersion":"1.1","method":"POST","post":"{\"using\":\"css selector\",\"value\":\"#username\"}","url":"/element","urlParsed":{"anchor":"","query":"","file":"element","directory":"/","path":"/element","relative":"/element","port":"","host":"","password":"","user":"","userInfo":"","authority":"","protocol":"","source":"/element","queryKey":{},"chunks":["element"]},"urlOriginal":"/session/495dfec0-41f4-11e4-a310-27adb6e31de7/element"}}
Command duration or timeout: 1.01 seconds
For documentation on this error, please visit: http://seleniumhq.org/exceptions/no_such_element.html
Build info: version: '2.34.0', revision: '11cd0ef93615408e0b6b3bfa28defe125906461a', time: '2013-08-06 11:43:14'
System info: os.name: 'Linux', os.arch: 'amd64', os.version: '3.2.0-60-generic', java.version: '1.6.0_45'
Session ID: 495dfec0-41f4-11e4-a310-27adb6e31de7
Driver info: com.continuuity.test.drivers.CustomPhantomJSDriver
Capabilities [{platform=LINUX, acceptSslCerts=false, javascriptEnabled=true, browserName=phantomjs, rotatable=false, driverVersion=1.1.0, locationContextEnabled=false, version=1.9.7, databaseEnabled=false, cssSelectorsEnabled=true, handlesAlerts=false, browserConnectionEnabled=false, proxy={proxyType=direct}, webStorageEnabled=false, nativeEvents=true, driverName=ghostdriver, applicationCacheEnabled=false, takesScreenshot=true}]
org.openqa.selenium.NoSuchElementException: {"errorMessage":"Unable to find element with css selector '#username'","request":{"headers":{"Accept":"application/json, image/png","Connection":"Keep-Alive","Content-Length":"44","Content-Type":"application/json; charset=utf-8","Host":"localhost:26617"},"httpVersion":"1.1","method":"POST","post":"{\"using\":\"css selector\",\"value\":\"#username\"}","url":"/element","urlParsed":{"anchor":"","query":"","file":"element","directory":"/","path":"/element","relative":"/element","port":"","host":"","password":"","user":"","userInfo":"","authority":"","protocol":"","source":"/element","queryKey":{},"chunks":["element"]},"urlOriginal":"/session/4b500ac0-41f4-11e4-aed2-d9d294ed097c/element"}}
Command duration or timeout: 1.00 seconds
For documentation on this error, please visit: http://seleniumhq.org/exceptions/no_such_element.html
Build info: version: '2.34.0', revision: '11cd0ef93615408e0b6b3bfa28defe125906461a', time: '2013-08-06 11:43:14'
System info: os.name: 'Linux', os.arch: 'amd64', os.version: '3.2.0-60-generic', java.version: '1.6.0_45'
Session ID: 4b500ac0-41f4-11e4-aed2-d9d294ed097c
Driver info: com.continuuity.test.drivers.CustomPhantomJSDriver
Capabilities [{platform=LINUX, acceptSslCerts=false, javascriptEnabled=true, browserName=phantomjs, rotatable=false, driverVersion=1.1.0, locationContextEnabled=false, version=1.9.7, databaseEnabled=false, cssSelectorsEnabled=true, handlesAlerts=false, browserConnectionEnabled=false, proxy={proxyType=direct}, webStorageEnabled=false, nativeEvents=true, driverName=ghostdriver, applicationCacheEnabled=false, takesScreenshot=true}]