Clusters with the click

Build: #280 failed Changes by Derek Wood

Build result summary

Details

Completed
Duration
4 minutes
Labels
None
Revision
480ce809b3031549eca7d5702bf06d1fac65e1b2 480ce809b3031549eca7d5702bf06d1fac65e1b2
Total tests
631
Failing since
#279 (Changes by Alvin Wang)
Fixed in
#281 (Changes by Rohit Nistala)

No failed tests found, a possible compilation error occurred.

  • 0 New failures
  • 0 Existing failures
  • 0 Fixed

Responsible

This build has been failing since #279
No one has taken responsibility

Code commits

Author Commit Message Commit date
Derek Wood Derek Wood 480ce809b3031549eca7d5702bf06d1fac65e1b2 480ce809b3031549eca7d5702bf06d1fac65e1b2 Merge pull request #909 from caskdata/feature/fix-standalone-start
register must wait for server during initial startup
Derek Wood Derek Wood a9fd94bcc25195ff1a4c649be2e3d1ff2650a7f4 a9fd94bcc25195ff1a4c649be2e3d1ff2650a7f4 register must wait for server during initial startup

Error summary for Default Job

The job generated some errors, drill down into the full build log for more details.

npm http GET https://registry.npmjs.org/bower
npm http GET https://registry.npmjs.org/serve-favicon
npm http GET https://registry.npmjs.org/gulp-angular-templatecache
npm http GET https://registry.npmjs.org/del
npm http GET https://registry.npmjs.org/gulp-autoprefixer
npm http GET https://registry.npmjs.org/gulp
npm http GET https://registry.npmjs.org/express
npm http GET https://registry.npmjs.org/gulp-livereload
npm http GET https://registry.npmjs.org/gulp-if
npm http GET https://registry.npmjs.org/gulp-concat
npm http GET https://registry.npmjs.org/gulp-debug
npm http GET https://registry.npmjs.org/gulp-load-plugins
npm http GET https://registry.npmjs.org/gulp-nodemon
npm http GET https://registry.npmjs.org/gulp-minify-css
npm http GET https://registry.npmjs.org/gulp-jshint
npm http GET https://registry.npmjs.org/gulp-replace
npm http GET https://registry.npmjs.org/gulp-uglify
npm http GET https://registry.npmjs.org/gulp-rev
npm http GET https://registry.npmjs.org/gulp-util
npm http GET https://registry.npmjs.org/gulp-size
npm http GET https://registry.npmjs.org/gulp-wrapper
npm http GET https://registry.npmjs.org/finalhandler
npm http GET https://registry.npmjs.org/jasmine-core
npm http GET https://registry.npmjs.org/gulp-ng-annotate
npm http GET https://registry.npmjs.org/gulp-less
npm http GET https://registry.npmjs.org/karma-jasmine
npm http GET https://registry.npmjs.org/http-proxy
npm http GET https://registry.npmjs.org/morgan
npm http GET https://registry.npmjs.org/karma
npm http GET https://registry.npmjs.org/main-bower-files
npm http GET https://registry.npmjs.org/karma-chrome-launcher
npm http GET https://registry.npmjs.org/merge-stream
npm http 200 https://registry.npmjs.org/del
npm http 200 https://registry.npmjs.org/gulp-autoprefixer
npm http 200 https://registry.npmjs.org/bower
npm ERR! Error: No compatible version found: del@'^1.0.0'
npm ERR! Valid install targets:
npm ERR! ["0.1.0","0.1.1","0.1.2","0.1.3","1.0.0","1.1.0","1.1.1"]
npm ERR!     at installTargetsError (/opt/node/lib/node_modules/npm/lib/cache.js:719:10)
npm ERR!     at /opt/node/lib/node_modules/npm/lib/cache.js:638:10
npm ERR!     at saved (/opt/node/lib/node_modules/npm/node_modules/npm-registry-client/lib/get.js:142:7)
npm ERR!     at /opt/node/lib/node_modules/npm/node_modules/graceful-fs/polyfills.js:133:7
npm ERR!     at Object.oncomplete (fs.js:107:15)
npm ERR! If you need help, you may report this log at:
npm ERR!     <http://github.com/isaacs/npm/issues>
npm ERR! or email it to:
npm ERR!     <npm-@googlegroups.com>

npm ERR! System Linux 2.6.32-431.29.2.el6.x86_64
npm ERR! command "/opt/node/bin/node" "/opt/node/bin/npm" "install"
npm ERR! cwd /var/bamboo/xml-data/build-dir/COOP-DBT-JOB1/coopr-ui
npm ERR! node -v v0.10.15
npm ERR! npm -v 1.3.5
npm http 200 https://registry.npmjs.org/serve-favicon
npm http 200 https://registry.npmjs.org/gulp
npm http 200 https://registry.npmjs.org/gulp-concat
npm http 200 https://registry.npmjs.org/gulp-livereload
npm http 200 https://registry.npmjs.org/express
npm http 200 https://registry.npmjs.org/gulp-if
npm http 200 https://registry.npmjs.org/gulp-angular-templatecache
npm http 200 https://registry.npmjs.org/gulp-debug
npm http 200 https://registry.npmjs.org/gulp-minify-css
npm http 200 https://registry.npmjs.org/gulp-load-plugins
npm http 200 https://registry.npmjs.org/gulp-replace
npm http 200 https://registry.npmjs.org/gulp-uglify
npm http 200 https://registry.npmjs.org/gulp-util
npm http 200 https://registry.npmjs.org/gulp-jshint
npm http 200 https://registry.npmjs.org/gulp-size
npm http 200 https://registry.npmjs.org/jasmine-core
npm http 200 https://registry.npmjs.org/gulp-wrapper
npm http 200 https://registry.npmjs.org/gulp-nodemon
npm http 200 https://registry.npmjs.org/gulp-less
npm http 200 https://registry.npmjs.org/karma-jasmine
npm http 200 https://registry.npmjs.org/gulp-ng-annotate
npm http 200 https://registry.npmjs.org/http-proxy
npm http GET https://registry.npmjs.org/jasmine-core/-/jasmine-core-2.2.0.tgz
npm http 200 https://registry.npmjs.org/main-bower-files
npm http 200 https://registry.npmjs.org/morgan
npm http 200 https://registry.npmjs.org/karma-chrome-launcher
npm http 200 https://registry.npmjs.org/merge-stream
npm http 200 https://registry.npmjs.org/jasmine-core/-/jasmine-core-2.2.0.tgz
npm http 200 https://registry.npmjs.org/finalhandler
npm http 200 https://registry.npmjs.org/gulp-rev
npm http 200 https://registry.npmjs.org/karma
npm ERR!
npm ERR! Additional logging details can be found in:
npm ERR!     /var/bamboo/xml-data/build-dir/COOP-DBT-JOB1/coopr-ui/npm-debug.log
npm ERR! not ok code 0
npm ERR! weird error 1
npm ERR! not ok code 0

module.js:340
    throw err;
          ^
Error: Cannot find module '/var/bamboo/xml-data/build-dir/COOP-DBT-JOB1/coopr-ui/node_modules/gulp/bin/gulp.js'
    at Function.Module._resolveFilename (module.js:338:15)
    at Function.Module._load (module.js:280:25)
    at Function.Module.runMain (module.js:497:10)
    at startup (node.js:119:16)
    at node.js:901:3