Clusters with the click

Build: #263 failed Changes by Chris Gianelloni

Build result summary

Details

Completed
Duration
3 minutes
Labels
None
Revision
1f1b0b1663e73b488b7e63a40e0a59984642d60f 1f1b0b1663e73b488b7e63a40e0a59984642d60f
Total tests
631
Fixed in
#266 (Changes by Alvin Wang)

No failed tests found, a possible compilation error occurred.

  • 0 New failures
  • 0 Existing failures
  • 0 Fixed

Responsible

Code commits

Author Commit Message Commit date
Chris Gianelloni Chris Gianelloni 1f1b0b1663e73b488b7e63a40e0a59984642d60f 1f1b0b1663e73b488b7e63a40e0a59984642d60f Merge pull request #889 from caskdata/feature/standalone-in-debug
Standalone in debug
Chris Gianelloni Chris Gianelloni f970916a93c3e8fda4da8d4f3e53e6c7b983a59c m f970916a93c3e8fda4da8d4f3e53e6c7b983a59c Merge remote-tracking branch 'origin/develop' into feature/standalone-in-debug
Chris Gianelloni Chris Gianelloni ed29ba0300e30f16c434457700f1a48ab87fcd89 m ed29ba0300e30f16c434457700f1a48ab87fcd89 Merge remote-tracking branch 'origin/develop' into feature/standalone-in-debug
Chris Gianelloni Chris Gianelloni 5477b9cf2a826cab4576261fa3b847bd69a7e71a m 5477b9cf2a826cab4576261fa3b847bd69a7e71a Put server and provisioner in debug for standalone

Error summary for Default Job

The job generated some errors, drill down into the full build log for more details.

npm http GET https://registry.npmjs.org/del
npm http GET https://registry.npmjs.org/gulp-angular-templatecache
npm http GET https://registry.npmjs.org/serve-favicon
npm http GET https://registry.npmjs.org/bower
npm http GET https://registry.npmjs.org/http-proxy
npm http GET https://registry.npmjs.org/gulp-autoprefixer
npm http GET https://registry.npmjs.org/gulp-jshint
npm http GET https://registry.npmjs.org/gulp-concat
npm http GET https://registry.npmjs.org/gulp-load-plugins
npm http GET https://registry.npmjs.org/gulp-less
npm http GET https://registry.npmjs.org/gulp-minify-css
npm http GET https://registry.npmjs.org/gulp-debug
npm http GET https://registry.npmjs.org/gulp-rev
npm http GET https://registry.npmjs.org/gulp-replace
npm http GET https://registry.npmjs.org/gulp-uglify
npm http GET https://registry.npmjs.org/gulp-util
npm http GET https://registry.npmjs.org/gulp-ng-annotate
npm http GET https://registry.npmjs.org/jasmine-core
npm http GET https://registry.npmjs.org/gulp-if
npm http GET https://registry.npmjs.org/karma-chrome-launcher
npm http GET https://registry.npmjs.org/karma-jasmine
npm http GET https://registry.npmjs.org/gulp-size
npm http GET https://registry.npmjs.org/gulp-livereload
npm http GET https://registry.npmjs.org/morgan
npm http GET https://registry.npmjs.org/gulp-nodemon
npm http GET https://registry.npmjs.org/merge-stream
npm http GET https://registry.npmjs.org/gulp-wrapper
npm http GET https://registry.npmjs.org/express
npm http GET https://registry.npmjs.org/karma
npm http GET https://registry.npmjs.org/main-bower-files
npm http GET https://registry.npmjs.org/finalhandler
npm http GET https://registry.npmjs.org/gulp
npm http 304 https://registry.npmjs.org/serve-favicon
npm http 200 https://registry.npmjs.org/http-proxy
npm ERR! Error: No compatible version found: serve-favicon@'^2.1.5'
npm ERR! Valid install targets:
npm ERR! ["2.0.0","2.0.1","2.1.0","2.1.1","2.1.2","2.1.3","2.1.4","2.1.5","2.1.6","2.1.7","2.2.0"]
npm ERR!     at installTargetsError (/opt/node/lib/node_modules/npm/lib/cache.js:719:10)
npm ERR!     at /opt/node/lib/node_modules/npm/lib/cache.js:638:10
npm ERR!     at saved (/opt/node/lib/node_modules/npm/node_modules/npm-registry-client/lib/get.js:142:7)
npm ERR!     at /opt/node/lib/node_modules/npm/node_modules/graceful-fs/polyfills.js:133:7
npm ERR!     at Object.oncomplete (fs.js:107:15)
npm ERR! If you need help, you may report this log at:
npm ERR!     <http://github.com/isaacs/npm/issues>
npm ERR! or email it to:
npm ERR!     <npm-@googlegroups.com>

npm ERR! System Linux 2.6.32-431.20.3.el6.x86_64
npm ERR! command "/opt/node/bin/node" "/opt/node/bin/npm" "install"
npm ERR! cwd /var/bamboo/xml-data/build-dir/COOP-DBT-JOB1/coopr-ui
npm ERR! node -v v0.10.15
npm ERR! npm -v 1.3.5
npm http 304 https://registry.npmjs.org/gulp-autoprefixer
npm http 304 https://registry.npmjs.org/gulp-jshint
npm http 304 https://registry.npmjs.org/del
npm http 304 https://registry.npmjs.org/gulp-concat
npm http 304 https://registry.npmjs.org/gulp-minify-css
npm http 200 https://registry.npmjs.org/bower
npm http 304 https://registry.npmjs.org/gulp-load-plugins
npm http 304 https://registry.npmjs.org/gulp-debug
npm http 304 https://registry.npmjs.org/gulp-uglify
npm http 304 https://registry.npmjs.org/gulp-rev
npm http 304 https://registry.npmjs.org/gulp-util
npm http 304 https://registry.npmjs.org/gulp-replace
npm http 304 https://registry.npmjs.org/gulp-less
npm http 304 https://registry.npmjs.org/karma-chrome-launcher
npm http 304 https://registry.npmjs.org/jasmine-core
npm http 304 https://registry.npmjs.org/karma-jasmine
npm http 304 https://registry.npmjs.org/gulp-ng-annotate
npm http 304 https://registry.npmjs.org/gulp-size
npm http 304 https://registry.npmjs.org/morgan
npm http 304 https://registry.npmjs.org/gulp-livereload
npm http 304 https://registry.npmjs.org/gulp-angular-templatecache
npm http 304 https://registry.npmjs.org/merge-stream
npm http 304 https://registry.npmjs.org/express
npm http 200 https://registry.npmjs.org/gulp-nodemon
npm http 304 https://registry.npmjs.org/gulp-if
npm http 304 https://registry.npmjs.org/finalhandler
npm http 304 https://registry.npmjs.org/main-bower-files
npm http 200 https://registry.npmjs.org/karma
npm http 304 https://registry.npmjs.org/gulp-wrapper
npm http 200 https://registry.npmjs.org/gulp
npm ERR!
npm ERR! Additional logging details can be found in:
npm ERR!     /var/bamboo/xml-data/build-dir/COOP-DBT-JOB1/coopr-ui/npm-debug.log
npm ERR! not ok code 0
npm ERR! weird error 1
npm ERR! not ok code 0

module.js:340
    throw err;
          ^
Error: Cannot find module '/var/bamboo/xml-data/build-dir/COOP-DBT-JOB1/coopr-ui/node_modules/gulp/bin/gulp.js'
    at Function.Module._resolveFilename (module.js:338:15)
    at Function.Module._load (module.js:280:25)
    at Function.Module.runMain (module.js:497:10)
    at startup (node.js:119:16)
    at node.js:901:3