Clusters with the click

Build: #250 failed Changes by Chris Gianelloni

Build result summary

Details

Completed
Duration
3 minutes
Labels
None
Revision
ee7fe3d7d9a2583ed0b015806ba6b40247bcff70 ee7fe3d7d9a2583ed0b015806ba6b40247bcff70
Total tests
609
Failing since
#248 (Changes by Alvin Wang)
Fixed in
#252 (Changes by Chris Gianelloni)

No failed tests found, a possible compilation error occurred.

  • 0 New failures
  • 0 Existing failures
  • 0 Fixed

Responsible

This build has been failing since #248
No one has taken responsibility

Code commits

Author Commit Message Commit date
Chris Gianelloni Chris Gianelloni ee7fe3d7d9a2583ed0b015806ba6b40247bcff70 ee7fe3d7d9a2583ed0b015806ba6b40247bcff70 Merge pull request #880 from caskdata/feature/provisioner-submodule
Move coopr-provisioner to a submodule
Chris Gianelloni Chris Gianelloni 40bc5c8dfbc4b7fc5db9f0c5fc4f63b12a66afb8 40bc5c8dfbc4b7fc5db9f0c5fc4f63b12a66afb8 Update to caskdata/coopr-provisioner@836eb29 for caskdata/coopr-provisioner#1
Chris Gianelloni Chris Gianelloni 836eb294a6fc22bd5663cde86f5e2abe58b20e8a 836eb294a6fc22bd5663cde86f5e2abe58b20e8a Oops. We conflicted with #881 so fixing.
Chris Gianelloni Chris Gianelloni c94714ad83f527e3652585196c45ffd0368c5f52 m c94714ad83f527e3652585196c45ffd0368c5f52 Use https for submodule checkout
Chris Gianelloni Chris Gianelloni 8bf523372727919090a0b0aeed1bb4606bf2ba5b m 8bf523372727919090a0b0aeed1bb4606bf2ba5b Remove coopr-provisioner from Travis CI testing

Error summary for Default Job

The job generated some errors, drill down into the full build log for more details.

npm http GET https://registry.npmjs.org/gulp-nodemon
npm http GET https://registry.npmjs.org/del
npm http GET https://registry.npmjs.org/finalhandler
npm http GET https://registry.npmjs.org/express
npm http GET https://registry.npmjs.org/bower
npm http GET https://registry.npmjs.org/gulp
npm http GET https://registry.npmjs.org/gulp-autoprefixer
npm http GET https://registry.npmjs.org/gulp-debug
npm http GET https://registry.npmjs.org/gulp-livereload
npm http GET https://registry.npmjs.org/gulp-if
npm http GET https://registry.npmjs.org/gulp-angular-templatecache
npm http GET https://registry.npmjs.org/gulp-ng-annotate
npm http GET https://registry.npmjs.org/gulp-rev
npm http GET https://registry.npmjs.org/morgan
npm http GET https://registry.npmjs.org/gulp-replace
npm http GET https://registry.npmjs.org/gulp-less
npm http GET https://registry.npmjs.org/gulp-jshint
npm http GET https://registry.npmjs.org/gulp-minify-css
npm http GET https://registry.npmjs.org/http-proxy
npm http GET https://registry.npmjs.org/gulp-util
npm http GET https://registry.npmjs.org/gulp-wrapper
npm http GET https://registry.npmjs.org/karma-chrome-launcher
npm http GET https://registry.npmjs.org/gulp-size
npm http GET https://registry.npmjs.org/gulp-concat
npm http GET https://registry.npmjs.org/merge-stream
npm http GET https://registry.npmjs.org/gulp-load-plugins
npm http GET https://registry.npmjs.org/main-bower-files
npm http GET https://registry.npmjs.org/gulp-uglify
npm http GET https://registry.npmjs.org/karma
npm http GET https://registry.npmjs.org/karma-jasmine
npm http GET https://registry.npmjs.org/serve-favicon
npm http GET https://registry.npmjs.org/jasmine-core
npm http 200 https://registry.npmjs.org/gulp-nodemon
npm http 200 https://registry.npmjs.org/finalhandler
npm ERR! Error: No compatible version found: gulp-nodemon@'^1.0.4'
npm ERR! Valid install targets:
npm ERR! ["0.0.1","0.0.2","0.0.3","0.1.0","0.1.1","0.1.2","1.0.0","1.0.1","1.0.2","1.0.3","1.0.4"]
npm ERR!     at installTargetsError (/opt/node/lib/node_modules/npm/lib/cache.js:719:10)
npm ERR!     at /opt/node/lib/node_modules/npm/lib/cache.js:638:10
npm ERR!     at saved (/opt/node/lib/node_modules/npm/node_modules/npm-registry-client/lib/get.js:142:7)
npm ERR!     at /opt/node/lib/node_modules/npm/node_modules/graceful-fs/polyfills.js:133:7
npm ERR!     at Object.oncomplete (fs.js:107:15)
npm ERR! If you need help, you may report this log at:
npm ERR!     <http://github.com/isaacs/npm/issues>
npm ERR! or email it to:
npm ERR!     <npm-@googlegroups.com>

npm ERR! System Linux 2.6.32-431.29.2.el6.x86_64
npm ERR! command "/opt/node/bin/node" "/opt/node/bin/npm" "install"
npm ERR! cwd /var/bamboo/xml-data/build-dir/COOP-DBT-JOB1/coopr-ui
npm ERR! node -v v0.10.15
npm ERR! npm -v 1.3.5
npm http 200 https://registry.npmjs.org/gulp-autoprefixer
npm http 200 https://registry.npmjs.org/bower
npm http 200 https://registry.npmjs.org/gulp-debug
npm http 200 https://registry.npmjs.org/gulp
npm http 200 https://registry.npmjs.org/del
npm http 200 https://registry.npmjs.org/gulp-livereload
npm http 304 https://registry.npmjs.org/gulp-if
npm http 200 https://registry.npmjs.org/morgan
npm http 200 https://registry.npmjs.org/express
npm http 200 https://registry.npmjs.org/gulp-angular-templatecache
npm http 200 https://registry.npmjs.org/gulp-ng-annotate
npm http 200 https://registry.npmjs.org/gulp-jshint
npm http 304 https://registry.npmjs.org/gulp-rev
npm http 200 https://registry.npmjs.org/gulp-replace
npm http 200 https://registry.npmjs.org/gulp-minify-css
npm http 200 https://registry.npmjs.org/gulp-less
npm http 304 https://registry.npmjs.org/karma-chrome-launcher
npm http 200 https://registry.npmjs.org/gulp-size
npm http 200 https://registry.npmjs.org/http-proxy
npm http 200 https://registry.npmjs.org/gulp-util
npm http 304 https://registry.npmjs.org/gulp-wrapper
npm http 200 https://registry.npmjs.org/merge-stream
npm http 200 https://registry.npmjs.org/gulp-concat
npm http 200 https://registry.npmjs.org/gulp-load-plugins
npm http 200 https://registry.npmjs.org/karma-jasmine
npm http 200 https://registry.npmjs.org/gulp-uglify
npm http 200 https://registry.npmjs.org/serve-favicon
npm http 200 https://registry.npmjs.org/karma
npm http 200 https://registry.npmjs.org/main-bower-files
npm http 200 https://registry.npmjs.org/jasmine-core
npm ERR!
npm ERR! Additional logging details can be found in:
npm ERR!     /var/bamboo/xml-data/build-dir/COOP-DBT-JOB1/coopr-ui/npm-debug.log
npm ERR! not ok code 0
npm ERR! weird error 1
npm ERR! not ok code 0

module.js:340
    throw err;
          ^
Error: Cannot find module '/var/bamboo/xml-data/build-dir/COOP-DBT-JOB1/coopr-ui/node_modules/gulp/bin/gulp.js'
    at Function.Module._resolveFilename (module.js:338:15)
    at Function.Module._load (module.js:280:25)
    at Function.Module.runMain (module.js:497:10)
    at startup (node.js:119:16)
    at node.js:901:3