Clusters with the click

Build result summary

Details

Completed
Duration
4 minutes
Labels
None
Revision
7a1885207c141b8b782cb8dc0950f860fd1f95b6 7a1885207c141b8b782cb8dc0950f860fd1f95b6
Total tests
607
Failing since
#238 (Changes by Chris Gianelloni)
Fixed in
#241 (Changes by albertshau <albert@cask.co>)

No failed tests found, a possible compilation error occurred.

  • 0 New failures
  • 0 Existing failures
  • 0 Fixed

Responsible

Code commits

Author Commit Message Commit date
Chris Gianelloni Chris Gianelloni 7a1885207c141b8b782cb8dc0950f860fd1f95b6 7a1885207c141b8b782cb8dc0950f860fd1f95b6 Merge pull request #873 from cybervisiontech/coopr-539
[coopr-539] info log on CREATE, DELETE events for provisioner added.
Constantine Povietkin <kpovetkin@continuuity.com> Constantine Povietkin <kpovetkin@continuuity.com> 9b2a7630386b2464b20d73b0ce5255daa2625714 9b2a7630386b2464b20d73b0ce5255daa2625714 [coopr-539] logs message extended for cluster CREATE and DELETE.
Constantine Povietkin <kpovetkin@continuuity.com> Constantine Povietkin <kpovetkin@continuuity.com> 1566cbb587301588b3d7e35e00c2fb640c398f37 1566cbb587301588b3d7e35e00c2fb640c398f37 [coopr-539] info log on CREATE, DELETE events for provisioner added.

Error summary for Default Job

The job generated some errors, drill down into the full build log for more details.

npm http GET https://registry.npmjs.org/gulp-angular-templatecache
npm http GET https://registry.npmjs.org/morgan
npm http GET https://registry.npmjs.org/serve-favicon
npm http GET https://registry.npmjs.org/bower
npm http GET https://registry.npmjs.org/gulp-if
npm http GET https://registry.npmjs.org/gulp-autoprefixer
npm http GET https://registry.npmjs.org/gulp-livereload
npm http GET https://registry.npmjs.org/gulp-concat
npm http GET https://registry.npmjs.org/del
npm http GET https://registry.npmjs.org/gulp-debug
npm http GET https://registry.npmjs.org/gulp-rev
npm http GET https://registry.npmjs.org/gulp-minify-css
npm http GET https://registry.npmjs.org/http-proxy
npm http GET https://registry.npmjs.org/gulp-less
npm http GET https://registry.npmjs.org/gulp-load-plugins
npm http GET https://registry.npmjs.org/gulp-uglify
npm http GET https://registry.npmjs.org/gulp-replace
npm http GET https://registry.npmjs.org/gulp-size
npm http GET https://registry.npmjs.org/jasmine-core
npm http GET https://registry.npmjs.org/gulp-wrapper
npm http GET https://registry.npmjs.org/karma-chrome-launcher
npm http GET https://registry.npmjs.org/gulp-jshint
npm http GET https://registry.npmjs.org/main-bower-files
npm http GET https://registry.npmjs.org/gulp-util
npm http GET https://registry.npmjs.org/gulp-ng-annotate
npm http GET https://registry.npmjs.org/karma-jasmine
npm http GET https://registry.npmjs.org/finalhandler
npm http GET https://registry.npmjs.org/karma
npm http GET https://registry.npmjs.org/merge-stream
npm http GET https://registry.npmjs.org/gulp
npm http GET https://registry.npmjs.org/express
npm http 200 https://registry.npmjs.org/serve-favicon
npm http 200 https://registry.npmjs.org/morgan
npm ERR! Error: No compatible version found: serve-favicon@'^2.1.5'
npm ERR! Valid install targets:
npm ERR! ["2.0.0","2.0.1","2.1.0","2.1.1","2.1.2","2.1.3","2.1.4","2.1.5","2.1.6","2.1.7","2.2.0"]
npm ERR!     at installTargetsError (/opt/node/lib/node_modules/npm/lib/cache.js:719:10)
npm ERR!     at /opt/node/lib/node_modules/npm/lib/cache.js:638:10
npm ERR!     at saved (/opt/node/lib/node_modules/npm/node_modules/npm-registry-client/lib/get.js:142:7)
npm ERR!     at /opt/node/lib/node_modules/npm/node_modules/graceful-fs/polyfills.js:133:7
npm ERR!     at Object.oncomplete (fs.js:107:15)
npm ERR! If you need help, you may report this log at:
npm ERR!     <http://github.com/isaacs/npm/issues>
npm ERR! or email it to:
npm ERR!     <npm-@googlegroups.com>

npm ERR! System Linux 2.6.32-431.29.2.el6.x86_64
npm ERR! command "/opt/node/bin/node" "/opt/node/bin/npm" "install"
npm ERR! cwd /var/bamboo/xml-data/build-dir/COOP-DBT-JOB1/coopr-ui
npm ERR! node -v v0.10.15
npm ERR! npm -v 1.3.5
npm http 200 https://registry.npmjs.org/gulp-angular-templatecache
npm http 200 https://registry.npmjs.org/gulp-autoprefixer
npm http 200 https://registry.npmjs.org/bower
npm http 200 https://registry.npmjs.org/del
npm http 200 https://registry.npmjs.org/gulp-livereload
npm http 200 https://registry.npmjs.org/gulp-debug
npm http 200 https://registry.npmjs.org/gulp-concat
npm http 200 https://registry.npmjs.org/gulp-minify-css
npm http 200 https://registry.npmjs.org/gulp-load-plugins
npm http 200 https://registry.npmjs.org/http-proxy
npm http 304 https://registry.npmjs.org/gulp-if
npm http 200 https://registry.npmjs.org/gulp-uglify
npm http 200 https://registry.npmjs.org/gulp-replace
npm http 304 https://registry.npmjs.org/gulp-wrapper
npm http 200 https://registry.npmjs.org/jasmine-core
npm http 304 https://registry.npmjs.org/karma-chrome-launcher
npm http 200 https://registry.npmjs.org/gulp-size
npm http 304 https://registry.npmjs.org/gulp-rev
npm http 200 https://registry.npmjs.org/main-bower-files
npm http 200 https://registry.npmjs.org/gulp-jshint
npm http 200 https://registry.npmjs.org/karma-jasmine
npm http 200 https://registry.npmjs.org/gulp-less
npm http 200 https://registry.npmjs.org/finalhandler
npm http 200 https://registry.npmjs.org/merge-stream
npm http 200 https://registry.npmjs.org/gulp-util
npm http 200 https://registry.npmjs.org/gulp-ng-annotate
npm http 200 https://registry.npmjs.org/gulp
npm http 200 https://registry.npmjs.org/karma
npm http 200 https://registry.npmjs.org/express
npm ERR!
npm ERR! Additional logging details can be found in:
npm ERR!     /var/bamboo/xml-data/build-dir/COOP-DBT-JOB1/coopr-ui/npm-debug.log
npm ERR! not ok code 0
npm ERR! weird error 1
npm ERR! not ok code 0

module.js:340
    throw err;
          ^
Error: Cannot find module '/var/bamboo/xml-data/build-dir/COOP-DBT-JOB1/coopr-ui/node_modules/gulp/bin/gulp.js'
    at Function.Module._resolveFilename (module.js:338:15)
    at Function.Module._load (module.js:280:25)
    at Function.Module.runMain (module.js:497:10)
    at startup (node.js:119:16)
    at node.js:901:3