Clusters with the click

Build: #239 failed Changes by 3 people

Build result summary

Details

Completed
Duration
4 minutes
Labels
None
Revision
ba0d3add0af5610b652feac6aff17cf842c0fd03 ba0d3add0af5610b652feac6aff17cf842c0fd03
Total tests
607
Failing since
#238 (Changes by Chris Gianelloni)
Fixed in
#241 (Changes by albertshau <albert@cask.co>)

No failed tests found, a possible compilation error occurred.

  • 0 New failures
  • 0 Existing failures
  • 0 Fixed

Responsible

Code commits

Author Commit Message Commit date
Adrien Cahen <gaarf@users.noreply.github.com> Adrien Cahen <gaarf@users.noreply.github.com> ba0d3add0af5610b652feac6aff17cf842c0fd03 ba0d3add0af5610b652feac6aff17cf842c0fd03 Merge pull request #867 from cybervisiontech/coopr-647-tolltips
[coopr-647-tolltips] [COOPR-UI CreateCluster Page] templates list shows template label instead of template description; template description is shown in tooltip
Constantine Povietkin <kpovetkin@continuuity.com> Constantine Povietkin <kpovetkin@continuuity.com> b4e7eba2b760f2e41a4105a02a2aca0d70eb7dc5 b4e7eba2b760f2e41a4105a02a2aca0d70eb7dc5 [coopr-647-tolltips] using ng-bind instead of label for option
Constantine Povietkin <povetkin.k@gmail.com> Constantine Povietkin <povetkin.k@gmail.com> a45ccd6a0c7a084c88566aacba8da8e5d3c14027 a45ccd6a0c7a084c88566aacba8da8e5d3c14027 [coopr-647-tolltips] [COOPR-UI CreateCluster Page] templates list shows template label instead of template description; template description is shown in tooltip

Error summary for Default Job

The job generated some errors, drill down into the full build log for more details.

npm http GET https://registry.npmjs.org/del
npm http GET https://registry.npmjs.org/finalhandler
npm http GET https://registry.npmjs.org/serve-favicon
npm http GET https://registry.npmjs.org/gulp-autoprefixer
npm http GET https://registry.npmjs.org/gulp-concat
npm http GET https://registry.npmjs.org/gulp-if
npm http GET https://registry.npmjs.org/gulp-livereload
npm http GET https://registry.npmjs.org/gulp-load-plugins
npm http GET https://registry.npmjs.org/gulp-minify-css
npm http GET https://registry.npmjs.org/gulp-replace
npm http GET https://registry.npmjs.org/gulp-debug
npm http GET https://registry.npmjs.org/gulp-rev
npm http GET https://registry.npmjs.org/gulp-ng-annotate
npm http GET https://registry.npmjs.org/gulp-jshint
npm http GET https://registry.npmjs.org/gulp-size
npm http GET https://registry.npmjs.org/gulp-less
npm http GET https://registry.npmjs.org/http-proxy
npm http GET https://registry.npmjs.org/gulp-util
npm http GET https://registry.npmjs.org/gulp-angular-templatecache
npm http GET https://registry.npmjs.org/gulp-uglify
npm http GET https://registry.npmjs.org/karma-jasmine
npm http GET https://registry.npmjs.org/morgan
npm http GET https://registry.npmjs.org/gulp-wrapper
npm http GET https://registry.npmjs.org/bower
npm http GET https://registry.npmjs.org/main-bower-files
npm http GET https://registry.npmjs.org/merge-stream
npm http GET https://registry.npmjs.org/gulp
npm http GET https://registry.npmjs.org/karma
npm http GET https://registry.npmjs.org/karma-chrome-launcher
npm http GET https://registry.npmjs.org/jasmine-core
npm http GET https://registry.npmjs.org/express
npm http 200 https://registry.npmjs.org/del
npm http 200 https://registry.npmjs.org/gulp-concat
npm http 304 https://registry.npmjs.org/finalhandler
npm ERR! Error: No compatible version found: gulp-concat@'^2.3.4'
npm ERR! Valid install targets:
npm ERR! ["0.0.1","1.0.0","1.1.0","2.0.0","2.1.0","2.1.1","2.1.2","2.1.3","2.1.4","2.1.5","2.1.6","2.1.7","2.2.0","2.3.0","2.3.3","2.3.4","2.3.5","2.4.0","2.4.1","2.4.2","2.4.3"]
npm ERR!     at installTargetsError (/opt/node/lib/node_modules/npm/lib/cache.js:719:10)
npm ERR!     at /opt/node/lib/node_modules/npm/lib/cache.js:638:10
npm ERR!     at saved (/opt/node/lib/node_modules/npm/node_modules/npm-registry-client/lib/get.js:142:7)
npm ERR!     at /opt/node/lib/node_modules/npm/node_modules/graceful-fs/polyfills.js:133:7
npm ERR!     at Object.oncomplete (fs.js:107:15)
npm ERR! If you need help, you may report this log at:
npm ERR!     <http://github.com/isaacs/npm/issues>
npm ERR! or email it to:
npm ERR!     <npm-@googlegroups.com>

npm ERR! System Linux 2.6.32-431.20.3.el6.x86_64
npm ERR! command "/opt/node/bin/node" "/opt/node/bin/npm" "install"
npm ERR! cwd /var/bamboo/xml-data/build-dir/COOP-DBT-JOB1/coopr-ui
npm ERR! node -v v0.10.15
npm ERR! npm -v 1.3.5
npm http 200 https://registry.npmjs.org/serve-favicon
npm http 304 https://registry.npmjs.org/gulp-livereload
npm http 200 https://registry.npmjs.org/gulp-replace
npm http 200 https://registry.npmjs.org/gulp-load-plugins
npm http 200 https://registry.npmjs.org/gulp-autoprefixer
npm http 304 https://registry.npmjs.org/gulp-if
npm http 304 https://registry.npmjs.org/gulp-debug
npm http 304 https://registry.npmjs.org/gulp-rev
npm http 200 https://registry.npmjs.org/gulp-jshint
npm http 304 https://registry.npmjs.org/http-proxy
npm http 200 https://registry.npmjs.org/gulp-ng-annotate
npm http 304 https://registry.npmjs.org/gulp-size
npm http 200 https://registry.npmjs.org/gulp-util
npm http 200 https://registry.npmjs.org/gulp-uglify
npm http 200 https://registry.npmjs.org/gulp-less
npm http 200 https://registry.npmjs.org/karma-jasmine
npm http 200 https://registry.npmjs.org/morgan
npm http 304 https://registry.npmjs.org/gulp-angular-templatecache
npm http 200 https://registry.npmjs.org/merge-stream
npm http 200 https://registry.npmjs.org/bower
npm http 200 https://registry.npmjs.org/gulp-minify-css
npm http 304 https://registry.npmjs.org/karma-chrome-launcher
npm http 304 https://registry.npmjs.org/main-bower-files
npm http 304 https://registry.npmjs.org/jasmine-core
npm http 200 https://registry.npmjs.org/karma
npm http 200 https://registry.npmjs.org/gulp
npm http 304 https://registry.npmjs.org/gulp-wrapper
npm http 200 https://registry.npmjs.org/express
npm ERR!
npm ERR! Additional logging details can be found in:
npm ERR!     /var/bamboo/xml-data/build-dir/COOP-DBT-JOB1/coopr-ui/npm-debug.log
npm ERR! not ok code 0
npm ERR! weird error 1
npm ERR! not ok code 0

module.js:340
    throw err;
          ^
Error: Cannot find module '/var/bamboo/xml-data/build-dir/COOP-DBT-JOB1/coopr-ui/node_modules/gulp/bin/gulp.js'
    at Function.Module._resolveFilename (module.js:338:15)
    at Function.Module._load (module.js:280:25)
    at Function.Module.runMain (module.js:497:10)
    at startup (node.js:119:16)
    at node.js:901:3