Clusters with the click

Build: #232 failed Changes by Alvin Wang

Build result summary

Details

Completed
Duration
3 minutes
Labels
None
Revision
22803df8a330524b3346800811b0f69834d5b3a4 22803df8a330524b3346800811b0f69834d5b3a4
Total tests
607
Failing since
#231 (Changes by Chris Gianelloni)
Fixed in
#236 (Changes by David Bajot)

No failed tests found, a possible compilation error occurred.

  • 0 New failures
  • 0 Existing failures
  • 0 Fixed

Responsible

Code commits

Author Commit Message Commit date
Alvin Wang Alvin Wang 22803df8a330524b3346800811b0f69834d5b3a4 22803df8a330524b3346800811b0f69834d5b3a4 Merge pull request #847 from cybervisiontech/feature/coopr-629
COOPR:629 Update template APIs to support extending templates and including partials
rpedanov <rpedanov@platfora.com> rpedanov <rpedanov@platfora.com> db8bf356922994ac930130b614bba2bd5cc6915f m db8bf356922994ac930130b614bba2bd5cc6915f COOPR-629 new line
rpedanov <rpedanov@platfora.com> rpedanov <rpedanov@platfora.com> 9be1a24d213559847848c23ad2efe15e06c6c68d m 9be1a24d213559847848c23ad2efe15e06c6c68d COOPR-629 template codec null guards add compatibilities codec into gson adapters template entities final links for to avoid errors merger now merge trough builders back num machines "1" value to ClusterServiceTest (rollback from develop) extra template tests java docs text fix
rpedanov <rpedanov@platfora.com> rpedanov <rpedanov@platfora.com> 76bff8e44a0567c99a96002b7dc4c9e4a5eff750 m 76bff8e44a0567c99a96002b7dc4c9e4a5eff750 COOPR-629 services order changes
rpedanov <rpedanov@platfora.com> rpedanov <rpedanov@platfora.com> 06c4967ee9c3bc1bf8e61da1adf6112215eb8ee6 m 06c4967ee9c3bc1bf8e61da1adf6112215eb8ee6 COOPR-629 resolve merge conflicts

JIRA issues

IssueDescriptionStatus
Unknown Issue TypeCOOPR-578Could not obtain issue details from JIRA
Unknown Issue TypeCOOPR-629Could not obtain issue details from JIRA
Unknown Issue TypeCOOPR-699Could not obtain issue details from JIRA

Error summary for Default Job

The job generated some errors, drill down into the full build log for more details.

    at Function.Module._load (module.js:280:25)
    at Function.Module.runMain (module.js:497:10)
    at startup (node.js:119:16)
    at node.js:901:3
npm http GET https://registry.npmjs.org/del
npm http GET https://registry.npmjs.org/gulp-concat
npm http GET https://registry.npmjs.org/gulp-angular-templatecache
npm http GET https://registry.npmjs.org/gulp
npm http GET https://registry.npmjs.org/finalhandler
npm http GET https://registry.npmjs.org/gulp-if
npm http GET https://registry.npmjs.org/http-proxy
npm http GET https://registry.npmjs.org/gulp-less
npm http GET https://registry.npmjs.org/gulp-jshint
npm http GET https://registry.npmjs.org/gulp-rev
npm http GET https://registry.npmjs.org/gulp-livereload
npm http GET https://registry.npmjs.org/gulp-debug
npm http GET https://registry.npmjs.org/gulp-ng-annotate
npm http GET https://registry.npmjs.org/gulp-replace
npm http GET https://registry.npmjs.org/gulp-minify-css
npm http GET https://registry.npmjs.org/gulp-uglify
npm http GET https://registry.npmjs.org/gulp-wrapper
npm http GET https://registry.npmjs.org/karma-jasmine
npm http GET https://registry.npmjs.org/gulp-util
npm http GET https://registry.npmjs.org/main-bower-files
npm http GET https://registry.npmjs.org/bower
npm http GET https://registry.npmjs.org/karma-chrome-launcher
npm http GET https://registry.npmjs.org/gulp-autoprefixer
npm http GET https://registry.npmjs.org/morgan
npm http GET https://registry.npmjs.org/serve-favicon
npm http GET https://registry.npmjs.org/gulp-load-plugins
npm http GET https://registry.npmjs.org/karma
npm http GET https://registry.npmjs.org/express
npm http GET https://registry.npmjs.org/merge-stream
npm http GET https://registry.npmjs.org/jasmine-core
npm http GET https://registry.npmjs.org/gulp-size
npm http 304 https://registry.npmjs.org/gulp-concat
npm http 304 https://registry.npmjs.org/gulp-if
npm http 200 https://registry.npmjs.org/del
npm http 304 https://registry.npmjs.org/finalhandler
npm http 304 https://registry.npmjs.org/gulp-less
npm http 200 https://registry.npmjs.org/http-proxy
npm http 200 https://registry.npmjs.org/gulp-angular-templatecache
npm http 304 https://registry.npmjs.org/gulp-rev
npm http 304 https://registry.npmjs.org/gulp-jshint
npm http 200 https://registry.npmjs.org/gulp-livereload
npm http 304 https://registry.npmjs.org/gulp-debug
npm ERR! Error: No compatible version found: gulp-if@'^1.2.4'
npm ERR! Valid install targets:
npm ERR! ["0.0.3","0.0.4","0.0.5","1.0.0","1.1.0","1.2.0","1.2.1","1.2.2","1.2.3","1.2.4","1.2.5"]
npm ERR!     at installTargetsError (/opt/node/lib/node_modules/npm/lib/cache.js:719:10)
npm ERR!     at /opt/node/lib/node_modules/npm/lib/cache.js:638:10
npm ERR!     at saved (/opt/node/lib/node_modules/npm/node_modules/npm-registry-client/lib/get.js:142:7)
npm ERR!     at /opt/node/lib/node_modules/npm/node_modules/graceful-fs/polyfills.js:133:7
npm ERR!     at Object.oncomplete (fs.js:107:15)
npm ERR! If you need help, you may report this log at:
npm ERR!     <http://github.com/isaacs/npm/issues>
npm ERR! or email it to:
npm ERR!     <npm-@googlegroups.com>

npm ERR! System Linux 2.6.32-431.29.2.el6.x86_64
npm ERR! command "/opt/node/bin/node" "/opt/node/bin/npm" "install"
npm ERR! cwd /var/bamboo/xml-data/build-dir/COOP-DBT-JOB1/coopr-ui
npm ERR! node -v v0.10.15
npm ERR! npm -v 1.3.5
npm http 200 https://registry.npmjs.org/gulp-uglify
npm http 304 https://registry.npmjs.org/gulp-minify-css
npm http 200 https://registry.npmjs.org/gulp
npm http 304 https://registry.npmjs.org/karma-jasmine
npm http 304 https://registry.npmjs.org/gulp-replace
npm http 304 https://registry.npmjs.org/gulp-util
npm http 200 https://registry.npmjs.org/gulp-ng-annotate
npm http 304 https://registry.npmjs.org/karma-chrome-launcher
npm http 304 https://registry.npmjs.org/morgan
npm http 304 https://registry.npmjs.org/gulp-wrapper
npm http 304 https://registry.npmjs.org/serve-favicon
npm http 304 https://registry.npmjs.org/gulp-load-plugins
npm http 200 https://registry.npmjs.org/gulp-autoprefixer
npm http 200 https://registry.npmjs.org/bower
npm http 304 https://registry.npmjs.org/jasmine-core
npm http 304 https://registry.npmjs.org/gulp-size
npm http 304 https://registry.npmjs.org/main-bower-files
npm http 304 https://registry.npmjs.org/merge-stream
npm http 200 https://registry.npmjs.org/karma
npm http 200 https://registry.npmjs.org/express
npm ERR!
npm ERR! Additional logging details can be found in:
npm ERR!     /var/bamboo/xml-data/build-dir/COOP-DBT-JOB1/coopr-ui/npm-debug.log
npm ERR! not ok code 0
npm ERR! weird error 1
npm ERR! not ok code 0

module.js:340
    throw err;
          ^
Error: Cannot find module '/var/bamboo/xml-data/build-dir/COOP-DBT-JOB1/coopr-ui/node_modules/gulp/bin/gulp.js'
    at Function.Module._resolveFilename (module.js:338:15)
    at Function.Module._load (module.js:280:25)
    at Function.Module.runMain (module.js:497:10)
    at startup (node.js:119:16)
    at node.js:901:3