Build #89

Build: #89 failed Scheduled

Logs

The following logs have been generated by the jobs in this branch.
  • Expand all
  • Collapse all
Job Logs
Collapse Default Job Default Stage Download or View
08-Apr-2018 00:00:17 [INFO] ------------------------------------------------------------------------
08-Apr-2018 00:00:17 [INFO] Building PurchaseApp 1.0.0
08-Apr-2018 00:00:17 [INFO] ------------------------------------------------------------------------
08-Apr-2018 00:00:18 [INFO] Downloading: https://oss.sonatype.org/content/repositories/snapshots/co/cask/cdap/cdap-api/2.8.0-SNAPSHOT/maven-metadata.xml
08-Apr-2018 00:00:18 [INFO] Downloading: https://oss.sonatype.org/content/repositories/snapshots/co/cask/cdap/cdap-api/2.8.0-SNAPSHOT/cdap-api-2.8.0-SNAPSHOT.pom
08-Apr-2018 00:00:18 [WARNING] The POM for co.cask.cdap:cdap-api:jar:2.8.0-SNAPSHOT is missing, no dependency information available
08-Apr-2018 00:00:18 [INFO] Downloading: https://oss.sonatype.org/content/repositories/snapshots/co/cask/cdap/cdap-unit-test/2.8.0-SNAPSHOT/maven-metadata.xml
08-Apr-2018 00:00:18 [INFO] Downloading: https://oss.sonatype.org/content/repositories/snapshots/co/cask/cdap/cdap-unit-test/2.8.0-SNAPSHOT/cdap-unit-test-2.8.0-SNAPSHOT.pom
08-Apr-2018 00:00:18 [WARNING] The POM for co.cask.cdap:cdap-unit-test:jar:2.8.0-SNAPSHOT is missing, no dependency information available
08-Apr-2018 00:00:18 [INFO] Downloading: https://oss.sonatype.org/content/repositories/snapshots/co/cask/cdap/cdap-api/2.8.0-SNAPSHOT/cdap-api-2.8.0-SNAPSHOT.jar
08-Apr-2018 00:00:18 [INFO] Downloading: https://oss.sonatype.org/content/repositories/snapshots/co/cask/cdap/cdap-unit-test/2.8.0-SNAPSHOT/cdap-unit-test-2.8.0-SNAPSHOT.jar
08-Apr-2018 00:00:19 [INFO] ------------------------------------------------------------------------
08-Apr-2018 00:00:19 [INFO] BUILD FAILURE
08-Apr-2018 00:00:19 [INFO] ------------------------------------------------------------------------
08-Apr-2018 00:00:19 [INFO] Total time: 3.458s
08-Apr-2018 00:00:19 [INFO] Finished at: Sun Apr 08 00:00:19 UTC 2018
08-Apr-2018 00:00:19 [INFO] Final Memory: 9M/224M
08-Apr-2018 00:00:19 [INFO] ------------------------------------------------------------------------
08-Apr-2018 00:00:19 [ERROR] Failed to execute goal on project cdap-bi-guide: Could not resolve dependencies for project co.cask.cdap.guides:cdap-bi-guide:jar:1.0.0: The following artifacts could not be resolved: co.cask.cdap:cdap-api:jar:2.8.0-SNAPSHOT, co.cask.cdap:cdap-unit-test:jar:2.8.0-SNAPSHOT: Could not find artifact co.cask.cdap:cdap-api:jar:2.8.0-SNAPSHOT in sonatype (https://oss.sonatype.org/content/repositories/snapshots/) -> [Help 1]
08-Apr-2018 00:00:19 [ERROR]
08-Apr-2018 00:00:19 [ERROR] To see the full stack trace of the errors, re-run Maven with the -e switch.
08-Apr-2018 00:00:19 [ERROR] Re-run Maven using the -X switch to enable full debug logging.
08-Apr-2018 00:00:19 [ERROR]
08-Apr-2018 00:00:19 [ERROR] For more information about the errors and possible solutions, please read the following articles:
08-Apr-2018 00:00:19 [ERROR] [Help 1] http://cwiki.apache.org/confluence/display/MAVEN/DependencyResolutionException