Build #14

Build: #14 failed Child of CDAP-DRC7115-398

Logs

The following logs have been generated by the jobs in this branch.
  • Expand all
  • Collapse all
Job Logs
Collapse Build Artifacts Build Stage Download or View
10-Jun-2020 16:44:22 [INFO] CDAP SPI ........................................... SUCCESS [  6.637 s]
10-Jun-2020 16:44:22 [INFO] CDAP API ........................................... SUCCESS [ 19.429 s]
10-Jun-2020 16:44:22 [INFO] CDAP Watchdog API .................................. SUCCESS [  4.368 s]
10-Jun-2020 16:44:22 [INFO] CDAP Data Format ................................... SUCCESS [  5.426 s]
10-Jun-2020 16:44:22 [INFO] CDAP Protocol ...................................... SUCCESS [  9.257 s]
10-Jun-2020 16:44:22 [INFO] CDAP Security SPI .................................. SUCCESS [  4.404 s]
10-Jun-2020 16:44:22 [INFO] CDAP Build Common .................................. SUCCESS [  3.436 s]
10-Jun-2020 16:44:22 [INFO] CDAP Common ........................................ SUCCESS [ 21.184 s]
10-Jun-2020 16:44:22 [INFO] CDAP UI ............................................ FAILURE [14:46 min]
10-Jun-2020 16:44:22 [INFO] ------------------------------------------------------------------------
10-Jun-2020 16:44:22 [INFO] BUILD FAILURE
10-Jun-2020 16:44:22 [INFO] ------------------------------------------------------------------------
10-Jun-2020 16:44:22 [INFO] Total time:  16:20 min
10-Jun-2020 16:44:22 [INFO] Finished at: 2020-06-10T16:44:22Z
10-Jun-2020 16:44:22 [INFO] ------------------------------------------------------------------------
10-Jun-2020 16:44:22 [ERROR] Failed to execute goal org.codehaus.mojo:exec-maven-plugin:1.3.1:exec (build-ui) on project cdap-ui: Command execution failed. Process exited with an error: 1 (Exit value: 1) -> [Help 1]
10-Jun-2020 16:44:22 [ERROR]
10-Jun-2020 16:44:22 [ERROR] To see the full stack trace of the errors, re-run Maven with the -e switch.
10-Jun-2020 16:44:22 [ERROR] Re-run Maven using the -X switch to enable full debug logging.
10-Jun-2020 16:44:22 [ERROR]
10-Jun-2020 16:44:22 [ERROR] For more information about the errors and possible solutions, please read the following articles:
10-Jun-2020 16:44:22 [ERROR] [Help 1] http://cwiki.apache.org/confluence/display/MAVEN/MojoExecutionException
10-Jun-2020 16:44:22 [ERROR]
10-Jun-2020 16:44:22 [ERROR] After correcting the problems, you can resume the build with the command
10-Jun-2020 16:44:22 [ERROR]   mvn <args> -rf :cdap-ui