Build #614

Build: #614 failed

Job: Unit Test Job failed

Stages & jobs

  1. Unit Test Stage

Job result summary

Completed
Duration
157 minutes
Agent
bamboo-agent18
Revision
c71d0273170c4cc622ce09657e7b49f03c393a2a c71d0273170c4cc622ce09657e7b49f03c393a2a
Total tests
2518
Fixed in
#615 (Child of CDAP-DRC-4153)

Tests

  • 2,518 tests in total
  • 3 tests failed
  • 3 failures are new
  • 13 tests were quarantined / skipped
  • 86 minutes taken in total.
New test failures 3
Status Test Duration
Collapse Failed PreviewDataPipelineTest testDataPipelinePreviewRuns History
38 secs
java.lang.AssertionError: expected:<2> but was:<0>
	at org.junit.Assert.fail(Assert.java:88)
	at org.junit.Assert.failNotEquals(Assert.java:743)
	at org.junit.Assert.assertEquals(Assert.java:118)
	at org.junit.Assert.assertEquals(Assert.java:555)
	at org.junit.Assert.assertEquals(Assert.java:542)
	at co.cask.cdap.datapipeline.preview.PreviewDataPipelineTest.validateMetric(PreviewDataPipelineTest.java:430)
	at co.cask.cdap.datapipeline.preview.PreviewDataPipelineTest.testDataPipelinePreviewRun(PreviewDataPipelineTest.java:162)
(49 more lines...)
Collapse Failed PreviewDataPipelineTest testMultiPhasePreview History
44 secs
java.lang.AssertionError: expected:<3> but was:<0>
	at org.junit.Assert.fail(Assert.java:88)
	at org.junit.Assert.failNotEquals(Assert.java:743)
	at org.junit.Assert.assertEquals(Assert.java:118)
	at org.junit.Assert.assertEquals(Assert.java:555)
	at org.junit.Assert.assertEquals(Assert.java:542)
	at co.cask.cdap.datapipeline.preview.PreviewDataPipelineTest.validateMetric(PreviewDataPipelineTest.java:430)
	at co.cask.cdap.datapipeline.preview.PreviewDataPipelineTest.testMultiplePhase(PreviewDataPipelineTest.java:291)
(49 more lines...)
Collapse Failed PreviewDataPipelineTest testPreviewFailedRun History
< 1 sec
co.cask.cdap.api.dataset.InstanceConflictException: Failed to add instance singleInput due to conflict, details: Response code: 409, message: 'Conflict', body: ''dataset:default.singleInput' already exists'
	at co.cask.cdap.data2.datafabric.dataset.DatasetServiceClient.addInstance(DatasetServiceClient.java:169)
	at co.cask.cdap.data2.datafabric.dataset.RemoteDatasetFramework.addInstance(RemoteDatasetFramework.java:147)
	at co.cask.cdap.data2.dataset2.ForwardingDatasetFramework.addInstance(ForwardingDatasetFramework.java:79)
	at co.cask.cdap.data2.dataset2.DatasetFramework.addInstance(DatasetFramework.java:140)
	at co.cask.cdap.test.UnitTestManager.addDatasetInstance(UnitTestManager.java:309)
	at co.cask.cdap.test.TestBase.addDatasetInstance(TestBase.java:788)
	at co.cask.cdap.test.TestBase.addDatasetInstance(TestBase.java:803)
(50 more lines...)

Error summary

The build generated some errors. See the full build log for more details.

Java HotSpot(TM) 64-Bit Server VM warning: ignoring option MaxPermSize=128m; support was removed in 8.0