Build #1,185

Build: #1185 failed

Job: Unit Test Job failed

Stages & jobs

  1. Unit Test Stage

Io.cdap.cdap.data2.transaction.distributed. transaction service client test: Test case result

The below summarizes the result of the test "Io.cdap.cdap.data2.transaction.distributed. transaction service client test" in build 1,185 of CDAP - Release Build and Test - Unit Test Job. View test case history
Description
Io.cdap.cdap.data2.transaction.distributed. transaction service client test
Test class
io.cdap.cdap.data2.transaction.distributed.TransactionServiceClientTest
Method
io.cdap.cdap.data2.transaction.distributed.TransactionServiceClientTest
Duration
1 min
Status
Failed (New Failure)

Error Log

com.google.common.util.concurrent.UncheckedExecutionException: java.lang.Exception: Service failed while running
	at com.google.common.util.concurrent.Futures.wrapAndThrowUnchecked(Futures.java:1015)
	at com.google.common.util.concurrent.Futures.getUnchecked(Futures.java:1001)
	at com.google.common.util.concurrent.AbstractService.stopAndWait(AbstractService.java:225)
	at io.cdap.cdap.data2.transaction.distributed.TransactionServiceClientTest.afterClass(TransactionServiceClientTest.java:158)
	at sun.reflect.NativeMethodAccessorImpl.invoke0(Native Method)
	at sun.reflect.NativeMethodAccessorImpl.invoke(NativeMethodAccessorImpl.java:62)
	at sun.reflect.DelegatingMethodAccessorImpl.invoke(DelegatingMethodAccessorImpl.java:43)
	at java.lang.reflect.Method.invoke(Method.java:498)
	at org.junit.runners.model.FrameworkMethod$1.runReflectiveCall(FrameworkMethod.java:47)
	at org.junit.internal.runners.model.ReflectiveCallable.run(ReflectiveCallable.java:12)
	at org.junit.runners.model.FrameworkMethod.invokeExplosively(FrameworkMethod.java:44)
	at org.junit.internal.runners.statements.RunAfters.evaluate(RunAfters.java:33)
	at org.junit.rules.ExternalResource$1.evaluate(ExternalResource.java:48)
	at org.junit.rules.RunRules.evaluate(RunRules.java:20)
	at org.junit.runners.ParentRunner.run(ParentRunner.java:309)
	at org.junit.runners.Suite.runChild(Suite.java:127)
	at org.junit.runners.Suite.runChild(Suite.java:26)
	at org.junit.runners.ParentRunner$3.run(ParentRunner.java:238)
	at org.junit.runners.ParentRunner$1.schedule(ParentRunner.java:63)
	at org.junit.runners.ParentRunner.runChildren(ParentRunner.java:236)
	at org.junit.runners.ParentRunner.access$000(ParentRunner.java:53)
	at org.junit.runners.ParentRunner$2.evaluate(ParentRunner.java:229)
	at org.junit.runners.ParentRunner.run(ParentRunner.java:309)
	at org.apache.maven.surefire.junitcore.JUnitCore.run(JUnitCore.java:55)
	at org.apache.maven.surefire.junitcore.JUnitCoreWrapper.createRequestAndRun(JUnitCoreWrapper.java:137)
	at org.apache.maven.surefire.junitcore.JUnitCoreWrapper.executeEager(JUnitCoreWrapper.java:107)
	at org.apache.maven.surefire.junitcore.JUnitCoreWrapper.execute(JUnitCoreWrapper.java:83)
	at org.apache.maven.surefire.junitcore.JUnitCoreWrapper.execute(JUnitCoreWrapper.java:75)
	at org.apache.maven.surefire.junitcore.JUnitCoreProvider.invoke(JUnitCoreProvider.java:161)
	at org.apache.maven.surefire.booter.ForkedBooter.invokeProviderInSameClassLoader(ForkedBooter.java:290)
	at org.apache.maven.surefire.booter.ForkedBooter.runSuitesInProcess(ForkedBooter.java:242)
	at org.apache.maven.surefire.booter.ForkedBooter.main(ForkedBooter.java:121)
Caused by: java.lang.Exception: Service failed while running
	at com.google.common.util.concurrent.AbstractService$1.failed(AbstractService.java:123)
	at com.google.common.util.concurrent.AbstractService$6$1.run(AbstractService.java:444)
	at com.google.common.util.concurrent.MoreExecutors$SameThreadExecutorService.execute(MoreExecutors.java:262)
	at com.google.common.util.concurrent.AbstractService$ListenerExecutorPair.execute(AbstractService.java:470)
	at com.google.common.util.concurrent.AbstractService$6.run(AbstractService.java:442)
	at com.google.common.util.concurrent.AbstractService.executeListeners(AbstractService.java:369)
	at com.google.common.util.concurrent.AbstractService.notifyFailed(AbstractService.java:313)
	at org.apache.tephra.distributed.TransactionService.access$1600(TransactionService.java:53)
	at org.apache.tephra.distributed.TransactionService$1.leader(TransactionService.java:117)
	at org.apache.twill.internal.zookeeper.LeaderElection.becomeLeader(LeaderElection.java:234)
	at org.apache.twill.internal.zookeeper.LeaderElection.access$1900(LeaderElection.java:54)
	at org.apache.twill.internal.zookeeper.LeaderElection$5.onSuccess(LeaderElection.java:212)
	at org.apache.twill.internal.zookeeper.LeaderElection$5.onSuccess(LeaderElection.java:191)
	at com.google.common.util.concurrent.Futures$6.run(Futures.java:799)
	at java.util.concurrent.ThreadPoolExecutor.runWorker(ThreadPoolExecutor.java:1142)
	at java.util.concurrent.ThreadPoolExecutor$Worker.run(ThreadPoolExecutor.java:617)
	at java.lang.Thread.run(Thread.java:745)
Caused by: com.google.common.util.concurrent.UncheckedExecutionException: org.apache.thrift.transport.TTransportException: Could not create ServerSocket on address /0.0.0.0:44384.
	at com.google.common.util.concurrent.Futures.wrapAndThrowUnchecked(Futures.java:1015)
	at com.google.common.util.concurrent.Futures.getUnchecked(Futures.java:1001)
	at com.google.common.util.concurrent.AbstractService.startAndWait(AbstractService.java:220)
	at com.google.common.util.concurrent.AbstractExecutionThreadService.startAndWait(AbstractExecutionThreadService.java:154)
	at org.apache.tephra.distributed.TransactionService$1.leader(TransactionService.java:110)
	... 8 more
Caused by: org.apache.thrift.transport.TTransportException: Could not create ServerSocket on address /0.0.0.0:44384.
	at org.apache.thrift.transport.TNonblockingServerSocket.<init>(TNonblockingServerSocket.java:96)
	at org.apache.thrift.transport.TNonblockingServerSocket.<init>(TNonblockingServerSocket.java:79)
	at org.apache.thrift.transport.TNonblockingServerSocket.<init>(TNonblockingServerSocket.java:75)
	at org.apache.tephra.rpc.ThriftRPCServer.startUp(ThriftRPCServer.java:179)
	at com.google.common.util.concurrent.AbstractExecutionThreadService$1$1.run(AbstractExecutionThreadService.java:47)
	... 1 more