Build #1,185

Build: #1185 failed

Job: Unit Test Job failed

Stages & jobs

  1. Unit Test Stage

Large change set: Test case result

The below summarizes the result of the test "Large change set" in build 1,185 of CDAP - Release Build and Test - Unit Test Job. View test case history
Description
Large change set
Test class
io.cdap.cdap.data2.transaction.distributed.TransactionServiceClientTest
Method
testLargeChangeSet
Duration
1 min
Status
Failed (New Failure)

Error Log

java.lang.RuntimeException: org.apache.thrift.TException: Unable to discover transaction service.
	at com.google.common.base.Throwables.propagate(Throwables.java:160)
	at org.apache.tephra.distributed.TransactionServiceClient.resetState(TransactionServiceClient.java:500)
	at io.cdap.cdap.data2.transaction.distributed.TransactionServiceClientTest.resetState(TransactionServiceClientTest.java:172)
	at sun.reflect.NativeMethodAccessorImpl.invoke0(Native Method)
	at sun.reflect.NativeMethodAccessorImpl.invoke(NativeMethodAccessorImpl.java:62)
	at sun.reflect.DelegatingMethodAccessorImpl.invoke(DelegatingMethodAccessorImpl.java:43)
	at java.lang.reflect.Method.invoke(Method.java:498)
	at org.junit.runners.model.FrameworkMethod$1.runReflectiveCall(FrameworkMethod.java:47)
	at org.junit.internal.runners.model.ReflectiveCallable.run(ReflectiveCallable.java:12)
	at org.junit.runners.model.FrameworkMethod.invokeExplosively(FrameworkMethod.java:44)
	at org.junit.internal.runners.statements.RunBefores.evaluate(RunBefores.java:24)
	at org.junit.runners.ParentRunner.runLeaf(ParentRunner.java:271)
	at org.junit.runners.BlockJUnit4ClassRunner.runChild(BlockJUnit4ClassRunner.java:70)
	at org.junit.runners.BlockJUnit4ClassRunner.runChild(BlockJUnit4ClassRunner.java:50)
	at org.junit.runners.ParentRunner$3.run(ParentRunner.java:238)
	at org.junit.runners.ParentRunner$1.schedule(ParentRunner.java:63)
	at org.junit.runners.ParentRunner.runChildren(ParentRunner.java:236)
	at org.junit.runners.ParentRunner.access$000(ParentRunner.java:53)
	at org.junit.runners.ParentRunner$2.evaluate(ParentRunner.java:229)
	at org.junit.internal.runners.statements.RunBefores.evaluate(RunBefores.java:26)
	at org.junit.internal.runners.statements.RunAfters.evaluate(RunAfters.java:27)
	at org.junit.rules.ExternalResource$1.evaluate(ExternalResource.java:48)
	at org.junit.rules.RunRules.evaluate(RunRules.java:20)
	at org.junit.runners.ParentRunner.run(ParentRunner.java:309)
	at org.junit.runners.Suite.runChild(Suite.java:127)
	at org.junit.runners.Suite.runChild(Suite.java:26)
	at org.junit.runners.ParentRunner$3.run(ParentRunner.java:238)
	at org.junit.runners.ParentRunner$1.schedule(ParentRunner.java:63)
	at org.junit.runners.ParentRunner.runChildren(ParentRunner.java:236)
	at org.junit.runners.ParentRunner.access$000(ParentRunner.java:53)
	at org.junit.runners.ParentRunner$2.evaluate(ParentRunner.java:229)
	at org.junit.runners.ParentRunner.run(ParentRunner.java:309)
	at org.apache.maven.surefire.junitcore.JUnitCore.run(JUnitCore.java:55)
	at org.apache.maven.surefire.junitcore.JUnitCoreWrapper.createRequestAndRun(JUnitCoreWrapper.java:137)
	at org.apache.maven.surefire.junitcore.JUnitCoreWrapper.executeEager(JUnitCoreWrapper.java:107)
	at org.apache.maven.surefire.junitcore.JUnitCoreWrapper.execute(JUnitCoreWrapper.java:83)
	at org.apache.maven.surefire.junitcore.JUnitCoreWrapper.execute(JUnitCoreWrapper.java:75)
	at org.apache.maven.surefire.junitcore.JUnitCoreProvider.invoke(JUnitCoreProvider.java:161)
	at org.apache.maven.surefire.booter.ForkedBooter.invokeProviderInSameClassLoader(ForkedBooter.java:290)
	at org.apache.maven.surefire.booter.ForkedBooter.runSuitesInProcess(ForkedBooter.java:242)
	at org.apache.maven.surefire.booter.ForkedBooter.main(ForkedBooter.java:121)
Caused by: org.apache.thrift.TException: Unable to discover transaction service.
	at org.apache.tephra.distributed.AbstractClientProvider.newClient(AbstractClientProvider.java:106)
	at org.apache.tephra.distributed.AbstractClientProvider.newClient(AbstractClientProvider.java:86)
	at org.apache.tephra.distributed.PooledClientProvider$TxClientPool.create(PooledClientProvider.java:47)
	at org.apache.tephra.distributed.PooledClientProvider$TxClientPool.create(PooledClientProvider.java:40)
	at org.apache.tephra.distributed.ElasticPool.getOrCreate(ElasticPool.java:138)
	at org.apache.tephra.distributed.ElasticPool.obtain(ElasticPool.java:125)
	at org.apache.tephra.distributed.PooledClientProvider.getCloseableClient(PooledClientProvider.java:98)
	at org.apache.tephra.distributed.TransactionServiceClient.execute(TransactionServiceClient.java:244)
	at org.apache.tephra.distributed.TransactionServiceClient.execute(TransactionServiceClient.java:215)
	at org.apache.tephra.distributed.TransactionServiceClient.resetState(TransactionServiceClient.java:490)
	... 39 more