Build #1,185

Build: #1185 failed

Job: Unit Test Job failed

Stages & jobs

  1. Unit Test Stage

Test results

  • 2,809 tests in total
  • 18 tests failed
  • 18 failures are new
  • 17 tests were quarantined / skipped
  • 141 minutes taken in total.

Build 1,185 has the following 18 errors: 18 new failure(s) occurred since the previous build.

New test failures 18
Status Test Duration
Collapse Failed TransactionServiceClientTest io.cdap.cdap.data2.transaction.distributed.TransactionServiceClientTest History
1 min
com.google.common.util.concurrent.UncheckedExecutionException: java.lang.Exception: Service failed while running
	at com.google.common.util.concurrent.Futures.wrapAndThrowUnchecked(Futures.java:1015)
	at com.google.common.util.concurrent.Futures.getUnchecked(Futures.java:1001)
	at com.google.common.util.concurrent.AbstractService.stopAndWait(AbstractService.java:225)
	at io.cdap.cdap.data2.transaction.distributed.TransactionServiceClientTest.afterClass(TransactionServiceClientTest.java:158)
	at sun.reflect.NativeMethodAccessorImpl.invoke0(Native Method)
	at sun.reflect.NativeMethodAccessorImpl.invoke(NativeMethodAccessorImpl.java:62)
	at sun.reflect.DelegatingMethodAccessorImpl.invoke(DelegatingMethodAccessorImpl.java:43)
(57 more lines...)
Collapse Failed TransactionServiceClientTest testAbortAfterCommit History
1 min
java.lang.RuntimeException: org.apache.thrift.TException: Unable to discover transaction service.
	at com.google.common.base.Throwables.propagate(Throwables.java:160)
	at org.apache.tephra.distributed.TransactionServiceClient.resetState(TransactionServiceClient.java:500)
	at io.cdap.cdap.data2.transaction.distributed.TransactionServiceClientTest.resetState(TransactionServiceClientTest.java:172)
	at sun.reflect.NativeMethodAccessorImpl.invoke0(Native Method)
	at sun.reflect.NativeMethodAccessorImpl.invoke(NativeMethodAccessorImpl.java:62)
	at sun.reflect.DelegatingMethodAccessorImpl.invoke(DelegatingMethodAccessorImpl.java:43)
	at java.lang.reflect.Method.invoke(Method.java:498)
(46 more lines...)
Collapse Failed TransactionServiceClientTest testAbortTwice History
1 min
java.lang.RuntimeException: org.apache.thrift.TException: Unable to discover transaction service.
	at com.google.common.base.Throwables.propagate(Throwables.java:160)
	at org.apache.tephra.distributed.TransactionServiceClient.resetState(TransactionServiceClient.java:500)
	at io.cdap.cdap.data2.transaction.distributed.TransactionServiceClientTest.resetState(TransactionServiceClientTest.java:172)
	at sun.reflect.NativeMethodAccessorImpl.invoke0(Native Method)
	at sun.reflect.NativeMethodAccessorImpl.invoke(NativeMethodAccessorImpl.java:62)
	at sun.reflect.DelegatingMethodAccessorImpl.invoke(DelegatingMethodAccessorImpl.java:43)
	at java.lang.reflect.Method.invoke(Method.java:498)
(46 more lines...)
Collapse Failed TransactionServiceClientTest testCheckpointing History
1 min
java.lang.RuntimeException: org.apache.thrift.TException: Unable to discover transaction service.
	at com.google.common.base.Throwables.propagate(Throwables.java:160)
	at org.apache.tephra.distributed.TransactionServiceClient.resetState(TransactionServiceClient.java:500)
	at io.cdap.cdap.data2.transaction.distributed.TransactionServiceClientTest.resetState(TransactionServiceClientTest.java:172)
	at sun.reflect.NativeMethodAccessorImpl.invoke0(Native Method)
	at sun.reflect.NativeMethodAccessorImpl.invoke(NativeMethodAccessorImpl.java:62)
	at sun.reflect.DelegatingMethodAccessorImpl.invoke(DelegatingMethodAccessorImpl.java:43)
	at java.lang.reflect.Method.invoke(Method.java:498)
(46 more lines...)
Collapse Failed TransactionServiceClientTest testCommitRaceHandling History
1 min
java.lang.RuntimeException: org.apache.thrift.TException: Unable to discover transaction service.
	at com.google.common.base.Throwables.propagate(Throwables.java:160)
	at org.apache.tephra.distributed.TransactionServiceClient.resetState(TransactionServiceClient.java:500)
	at io.cdap.cdap.data2.transaction.distributed.TransactionServiceClientTest.resetState(TransactionServiceClientTest.java:172)
	at sun.reflect.GeneratedMethodAccessor9.invoke(Unknown Source)
	at sun.reflect.DelegatingMethodAccessorImpl.invoke(DelegatingMethodAccessorImpl.java:43)
	at java.lang.reflect.Method.invoke(Method.java:498)
	at org.junit.runners.model.FrameworkMethod$1.runReflectiveCall(FrameworkMethod.java:47)
(45 more lines...)
Collapse Failed TransactionServiceClientTest testCommitTwice History
1 min
java.lang.RuntimeException: org.apache.thrift.TException: Unable to discover transaction service.
	at com.google.common.base.Throwables.propagate(Throwables.java:160)
	at org.apache.tephra.distributed.TransactionServiceClient.resetState(TransactionServiceClient.java:500)
	at io.cdap.cdap.data2.transaction.distributed.TransactionServiceClientTest.resetState(TransactionServiceClientTest.java:172)
	at sun.reflect.NativeMethodAccessorImpl.invoke0(Native Method)
	at sun.reflect.NativeMethodAccessorImpl.invoke(NativeMethodAccessorImpl.java:62)
	at sun.reflect.DelegatingMethodAccessorImpl.invoke(DelegatingMethodAccessorImpl.java:43)
	at java.lang.reflect.Method.invoke(Method.java:498)
(46 more lines...)
Collapse Failed TransactionServiceClientTest testExcessiveTimeout History
1 min
java.lang.RuntimeException: org.apache.thrift.TException: Unable to discover transaction service.
	at com.google.common.base.Throwables.propagate(Throwables.java:160)
	at org.apache.tephra.distributed.TransactionServiceClient.resetState(TransactionServiceClient.java:500)
	at io.cdap.cdap.data2.transaction.distributed.TransactionServiceClientTest.resetState(TransactionServiceClientTest.java:172)
	at sun.reflect.NativeMethodAccessorImpl.invoke0(Native Method)
	at sun.reflect.NativeMethodAccessorImpl.invoke(NativeMethodAccessorImpl.java:62)
	at sun.reflect.DelegatingMethodAccessorImpl.invoke(DelegatingMethodAccessorImpl.java:43)
	at java.lang.reflect.Method.invoke(Method.java:498)
(46 more lines...)
Collapse Failed TransactionServiceClientTest testGetInvalidSize History
1 min
java.lang.RuntimeException: org.apache.thrift.TException: Unable to discover transaction service.
	at com.google.common.base.Throwables.propagate(Throwables.java:160)
	at org.apache.tephra.distributed.TransactionServiceClient.resetState(TransactionServiceClient.java:500)
	at io.cdap.cdap.data2.transaction.distributed.TransactionServiceClientTest.resetState(TransactionServiceClientTest.java:172)
	at sun.reflect.NativeMethodAccessorImpl.invoke0(Native Method)
	at sun.reflect.NativeMethodAccessorImpl.invoke(NativeMethodAccessorImpl.java:62)
	at sun.reflect.DelegatingMethodAccessorImpl.invoke(DelegatingMethodAccessorImpl.java:43)
	at java.lang.reflect.Method.invoke(Method.java:498)
(46 more lines...)
Collapse Failed TransactionServiceClientTest testGetSnapshot History
1 min
java.lang.RuntimeException: org.apache.thrift.TException: Unable to discover transaction service.
	at com.google.common.base.Throwables.propagate(Throwables.java:160)
	at org.apache.tephra.distributed.TransactionServiceClient.resetState(TransactionServiceClient.java:500)
	at io.cdap.cdap.data2.transaction.distributed.TransactionServiceClientTest.resetState(TransactionServiceClientTest.java:172)
	at sun.reflect.NativeMethodAccessorImpl.invoke0(Native Method)
	at sun.reflect.NativeMethodAccessorImpl.invoke(NativeMethodAccessorImpl.java:62)
	at sun.reflect.DelegatingMethodAccessorImpl.invoke(DelegatingMethodAccessorImpl.java:43)
	at java.lang.reflect.Method.invoke(Method.java:498)
(46 more lines...)
Collapse Failed TransactionServiceClientTest testInvalidateTx History
1 min
java.lang.RuntimeException: org.apache.thrift.TException: Unable to discover transaction service.
	at com.google.common.base.Throwables.propagate(Throwables.java:160)
	at org.apache.tephra.distributed.TransactionServiceClient.resetState(TransactionServiceClient.java:500)
	at io.cdap.cdap.data2.transaction.distributed.TransactionServiceClientTest.resetState(TransactionServiceClientTest.java:172)
	at sun.reflect.NativeMethodAccessorImpl.invoke0(Native Method)
	at sun.reflect.NativeMethodAccessorImpl.invoke(NativeMethodAccessorImpl.java:62)
	at sun.reflect.DelegatingMethodAccessorImpl.invoke(DelegatingMethodAccessorImpl.java:43)
	at java.lang.reflect.Method.invoke(Method.java:498)
(46 more lines...)
Collapse Failed TransactionServiceClientTest testLargeChangeSet History
1 min
java.lang.RuntimeException: org.apache.thrift.TException: Unable to discover transaction service.
	at com.google.common.base.Throwables.propagate(Throwables.java:160)
	at org.apache.tephra.distributed.TransactionServiceClient.resetState(TransactionServiceClient.java:500)
	at io.cdap.cdap.data2.transaction.distributed.TransactionServiceClientTest.resetState(TransactionServiceClientTest.java:172)
	at sun.reflect.NativeMethodAccessorImpl.invoke0(Native Method)
	at sun.reflect.NativeMethodAccessorImpl.invoke(NativeMethodAccessorImpl.java:62)
	at sun.reflect.DelegatingMethodAccessorImpl.invoke(DelegatingMethodAccessorImpl.java:43)
	at java.lang.reflect.Method.invoke(Method.java:498)
(46 more lines...)
Collapse Failed TransactionServiceClientTest testMultipleCommitsAtSameTime History
1 min
java.lang.RuntimeException: org.apache.thrift.TException: Unable to discover transaction service.
	at com.google.common.base.Throwables.propagate(Throwables.java:160)
	at org.apache.tephra.distributed.TransactionServiceClient.resetState(TransactionServiceClient.java:500)
	at io.cdap.cdap.data2.transaction.distributed.TransactionServiceClientTest.resetState(TransactionServiceClientTest.java:172)
	at sun.reflect.NativeMethodAccessorImpl.invoke0(Native Method)
	at sun.reflect.NativeMethodAccessorImpl.invoke(NativeMethodAccessorImpl.java:62)
	at sun.reflect.DelegatingMethodAccessorImpl.invoke(DelegatingMethodAccessorImpl.java:43)
	at java.lang.reflect.Method.invoke(Method.java:498)
(46 more lines...)
Collapse Failed TransactionServiceClientTest testNegativeTimeout History
1 min
java.lang.RuntimeException: org.apache.thrift.TException: Unable to discover transaction service.
	at com.google.common.base.Throwables.propagate(Throwables.java:160)
	at org.apache.tephra.distributed.TransactionServiceClient.resetState(TransactionServiceClient.java:500)
	at io.cdap.cdap.data2.transaction.distributed.TransactionServiceClientTest.resetState(TransactionServiceClientTest.java:172)
	at sun.reflect.NativeMethodAccessorImpl.invoke0(Native Method)
	at sun.reflect.NativeMethodAccessorImpl.invoke(NativeMethodAccessorImpl.java:62)
	at sun.reflect.DelegatingMethodAccessorImpl.invoke(DelegatingMethodAccessorImpl.java:43)
	at java.lang.reflect.Method.invoke(Method.java:498)
(46 more lines...)
Collapse Failed TransactionServiceClientTest testResetState History
1 min
java.lang.RuntimeException: org.apache.thrift.TException: Unable to discover transaction service.
	at com.google.common.base.Throwables.propagate(Throwables.java:160)
	at org.apache.tephra.distributed.TransactionServiceClient.resetState(TransactionServiceClient.java:500)
	at io.cdap.cdap.data2.transaction.distributed.TransactionServiceClientTest.resetState(TransactionServiceClientTest.java:172)
	at sun.reflect.NativeMethodAccessorImpl.invoke0(Native Method)
	at sun.reflect.NativeMethodAccessorImpl.invoke(NativeMethodAccessorImpl.java:62)
	at sun.reflect.DelegatingMethodAccessorImpl.invoke(DelegatingMethodAccessorImpl.java:43)
	at java.lang.reflect.Method.invoke(Method.java:498)
(46 more lines...)
Collapse Failed TransactionServiceClientTest testReuseTx History
1 min
java.lang.RuntimeException: org.apache.thrift.TException: Unable to discover transaction service.
	at com.google.common.base.Throwables.propagate(Throwables.java:160)
	at org.apache.tephra.distributed.TransactionServiceClient.resetState(TransactionServiceClient.java:500)
	at io.cdap.cdap.data2.transaction.distributed.TransactionServiceClientTest.resetState(TransactionServiceClientTest.java:172)
	at sun.reflect.NativeMethodAccessorImpl.invoke0(Native Method)
	at sun.reflect.NativeMethodAccessorImpl.invoke(NativeMethodAccessorImpl.java:62)
	at sun.reflect.DelegatingMethodAccessorImpl.invoke(DelegatingMethodAccessorImpl.java:43)
	at java.lang.reflect.Method.invoke(Method.java:498)
(46 more lines...)
Collapse Failed TransactionServiceClientTest testTruncateInvalidTx History
1 min
java.lang.RuntimeException: org.apache.thrift.TException: Unable to discover transaction service.
	at com.google.common.base.Throwables.propagate(Throwables.java:160)
	at org.apache.tephra.distributed.TransactionServiceClient.resetState(TransactionServiceClient.java:500)
	at io.cdap.cdap.data2.transaction.distributed.TransactionServiceClientTest.resetState(TransactionServiceClientTest.java:172)
	at sun.reflect.NativeMethodAccessorImpl.invoke0(Native Method)
	at sun.reflect.NativeMethodAccessorImpl.invoke(NativeMethodAccessorImpl.java:62)
	at sun.reflect.DelegatingMethodAccessorImpl.invoke(DelegatingMethodAccessorImpl.java:43)
	at java.lang.reflect.Method.invoke(Method.java:498)
(46 more lines...)
Collapse Failed TransactionServiceClientTest testTruncateInvalidTxBefore History
1 min
java.lang.RuntimeException: org.apache.thrift.TException: Unable to discover transaction service.
	at com.google.common.base.Throwables.propagate(Throwables.java:160)
	at org.apache.tephra.distributed.TransactionServiceClient.resetState(TransactionServiceClient.java:500)
	at io.cdap.cdap.data2.transaction.distributed.TransactionServiceClientTest.resetState(TransactionServiceClientTest.java:172)
	at sun.reflect.NativeMethodAccessorImpl.invoke0(Native Method)
	at sun.reflect.NativeMethodAccessorImpl.invoke(NativeMethodAccessorImpl.java:62)
	at sun.reflect.DelegatingMethodAccessorImpl.invoke(DelegatingMethodAccessorImpl.java:43)
	at java.lang.reflect.Method.invoke(Method.java:498)
(46 more lines...)
Collapse Failed TransactionServiceClientTest testUseNotStarted History
1 min
java.lang.RuntimeException: org.apache.thrift.TException: Unable to discover transaction service.
	at com.google.common.base.Throwables.propagate(Throwables.java:160)
	at org.apache.tephra.distributed.TransactionServiceClient.resetState(TransactionServiceClient.java:500)
	at io.cdap.cdap.data2.transaction.distributed.TransactionServiceClientTest.resetState(TransactionServiceClientTest.java:172)
	at sun.reflect.NativeMethodAccessorImpl.invoke0(Native Method)
	at sun.reflect.NativeMethodAccessorImpl.invoke(NativeMethodAccessorImpl.java:62)
	at sun.reflect.DelegatingMethodAccessorImpl.invoke(DelegatingMethodAccessorImpl.java:43)
	at java.lang.reflect.Method.invoke(Method.java:498)
(46 more lines...)