Build #664

Build: #664 failed Child of CDAP-DRC-4235

Build result summary

Details

Completed
Duration
134 minutes
Labels
None
Agent
bamboo-agent11
Revision
c5ba76b9f1f0ad06e23d7bb49b128abbb66f491c c5ba76b9f1f0ad06e23d7bb49b128abbb66f491c
Total tests
2252
Fixed in
#666 (Child of CDAP-DRC-4238)

Responsible

Code commits

Author Commit Message Commit date
Jay Jin Jay Jin c5ba76b9f1f0ad06e23d7bb49b128abbb66f491c c5ba76b9f1f0ad06e23d7bb49b128abbb66f491c Merge pull request #10976 from cdapio/feature/CDAP-14770-migrate-NAmespaceMDS2
Feature/cdap 14770 migrate NamespaceMDS
Jay Jin <jayjin@jayjin-macbookpro2.roam.corp.google.com> Jay Jin <jayjin@jayjin-macbookpro2.roam.corp.google.com> 761429b0b22cb1ffb5d2218724aa7006a6c2da6c m 761429b0b22cb1ffb5d2218724aa7006a6c2da6c Rename namespace table name
Jay Jin <jayjin@jayjin-macbookpro2.roam.corp.google.com> Jay Jin <jayjin@jayjin-macbookpro2.roam.corp.google.com> fdf81a06f1bf69e14935f29713f0474b16aaffa7 m fdf81a06f1bf69e14935f29713f0474b16aaffa7 Address comments
Jay Jin <jayjin@jayjin-macbookpro2.roam.corp.google.com> Jay Jin <jayjin@jayjin-macbookpro2.roam.corp.google.com> 780259e767329b8591511d0ee6b23f007ea4c201 m 780259e767329b8591511d0ee6b23f007ea4c201 Create sql and nosql versions of DefaultStoreTest
Jay Jin <jayjin@jayjin-macbookpro2.roam.corp.google.com> Jay Jin <jayjin@jayjin-macbookpro2.roam.corp.google.com> 61d454e2c5a679eb2e6235b5a97262caea3da5f7 m 61d454e2c5a679eb2e6235b5a97262caea3da5f7 Merge branch 'feature/CDAP-14770-migrate-NAmespaceMDS2' of https://github.com/cdapio/cdap into feature/CDAP-14770-migrate-NAmespaceMDS2

Tests

New test failures 5
Status Test View job Duration
Collapse Failed PreviewDataPipelineTest testMultiPhasePreview History
Unit Test Job 4 secs
com.google.common.util.concurrent.UncheckedExecutionException: java.lang.RuntimeException: co.cask.cdap.spi.data.transaction.TransactionException: Failure executing NoSql transaction:
	at com.google.common.cache.LocalCache$Segment.get(LocalCache.java:2258)
	at com.google.common.cache.LocalCache.get(LocalCache.java:3990)
	at com.google.common.cache.LocalCache.getOrLoad(LocalCache.java:3994)
	at com.google.common.cache.LocalCache$LocalLoadingCache.get(LocalCache.java:4878)
	at co.cask.cdap.internal.app.namespace.DefaultNamespaceAdmin.get(DefaultNamespaceAdmin.java:411)
	at co.cask.cdap.internal.app.namespace.DefaultNamespaceAdmin.exists(DefaultNamespaceAdmin.java:447)
	at co.cask.cdap.internal.app.namespace.DefaultNamespaceAdmin.create(DefaultNamespaceAdmin.java:125)
(121 more lines...)
Collapse Failed PreviewDataPipelineTest testPreviewFailedRun History
Unit Test Job < 1 sec
co.cask.cdap.api.dataset.InstanceConflictException: Failed to add instance singleInput due to conflict, details: Response code: 409, message: 'Conflict', body: ''dataset:default.singleInput' already exists'
	at co.cask.cdap.data2.datafabric.dataset.DatasetServiceClient.addInstance(DatasetServiceClient.java:169)
	at co.cask.cdap.data2.datafabric.dataset.RemoteDatasetFramework.addInstance(RemoteDatasetFramework.java:147)
	at co.cask.cdap.data2.dataset2.ForwardingDatasetFramework.addInstance(ForwardingDatasetFramework.java:79)
	at co.cask.cdap.data2.dataset2.DatasetFramework.addInstance(DatasetFramework.java:140)
	at co.cask.cdap.test.UnitTestManager.addDatasetInstance(UnitTestManager.java:299)
	at co.cask.cdap.test.TestBase.addDatasetInstance(TestBase.java:739)
	at co.cask.cdap.test.TestBase.addDatasetInstance(TestBase.java:754)
(50 more lines...)
Collapse Failed PreviewDataPipelineTest testDataPipelinePreviewRuns History
Unit Test Job 6 secs
com.google.common.util.concurrent.UncheckedExecutionException: java.lang.RuntimeException: co.cask.cdap.spi.data.transaction.TransactionException: Failure executing NoSql transaction:
	at com.google.common.cache.LocalCache$Segment.get(LocalCache.java:2258)
	at com.google.common.cache.LocalCache.get(LocalCache.java:3990)
	at com.google.common.cache.LocalCache.getOrLoad(LocalCache.java:3994)
	at com.google.common.cache.LocalCache$LocalLoadingCache.get(LocalCache.java:4878)
	at co.cask.cdap.internal.app.namespace.DefaultNamespaceAdmin.get(DefaultNamespaceAdmin.java:411)
	at co.cask.cdap.internal.app.namespace.DefaultNamespaceAdmin.exists(DefaultNamespaceAdmin.java:447)
	at co.cask.cdap.internal.app.namespace.DefaultNamespaceAdmin.create(DefaultNamespaceAdmin.java:125)
(121 more lines...)
Collapse Failed PreviewDataStreamsTest testDataStreamsPreviewRun History
Unit Test Job 6 secs
com.google.common.util.concurrent.UncheckedExecutionException: java.lang.RuntimeException: co.cask.cdap.spi.data.transaction.TransactionException: Failure executing NoSql transaction:
	at com.google.common.cache.LocalCache$Segment.get(LocalCache.java:2258)
	at com.google.common.cache.LocalCache.get(LocalCache.java:3990)
	at com.google.common.cache.LocalCache.getOrLoad(LocalCache.java:3994)
	at com.google.common.cache.LocalCache$LocalLoadingCache.get(LocalCache.java:4878)
	at co.cask.cdap.internal.app.namespace.DefaultNamespaceAdmin.get(DefaultNamespaceAdmin.java:411)
	at co.cask.cdap.internal.app.namespace.DefaultNamespaceAdmin.exists(DefaultNamespaceAdmin.java:447)
	at co.cask.cdap.internal.app.namespace.DefaultNamespaceAdmin.create(DefaultNamespaceAdmin.java:125)
(120 more lines...)
Collapse Failed GatewayFastTestsSuite co.cask.cdap.gateway.GatewayFastTestsSuite History
Unit Test Job < 1 sec
com.google.common.util.concurrent.UncheckedExecutionException: java.lang.RuntimeException: co.cask.cdap.spi.data.transaction.TransactionException: Failure executing NoSql transaction:
	at com.google.common.cache.LocalCache$Segment.get(LocalCache.java:2258)
	at com.google.common.cache.LocalCache.get(LocalCache.java:3990)
	at com.google.common.cache.LocalCache.getOrLoad(LocalCache.java:3994)
	at com.google.common.cache.LocalCache$LocalLoadingCache.get(LocalCache.java:4878)
	at co.cask.cdap.internal.app.namespace.DefaultNamespaceAdmin.get(DefaultNamespaceAdmin.java:411)
	at co.cask.cdap.internal.app.namespace.DefaultNamespaceAdmin.exists(DefaultNamespaceAdmin.java:447)
	at co.cask.cdap.internal.app.namespace.DefaultNamespaceAdmin.create(DefaultNamespaceAdmin.java:125)
(67 more lines...)