Build #507

Build: #507 failed Child of CDAP-DRC-3938

Build result summary

Details

Completed
Duration
147 minutes
Labels
None
Agent
bamboo-agent19
Revision
be7c5069a9b250132227152f6158bf0b5fa81ce9 be7c5069a9b250132227152f6158bf0b5fa81ce9
Total tests
2428
Fixed in
#509 (Child of CDAP-DRC-3941)

Responsible

Code commits

Author Commit Message Commit date
Bhooshan Mogal Bhooshan Mogal be7c5069a9b250132227152f6158bf0b5fa81ce9 be7c5069a9b250132227152f6158bf0b5fa81ce9 Merge pull request #10494 from caskdata/feature-ui/CDAP-12957-plugin-display-name
[CDAP-12957] use plugin display name for node config header
Edwin Elia <edwinelia@google.com> Edwin Elia <edwinelia@google.com> ea6066679fb2f3ddc8dc10183036f4a965c4215e m ea6066679fb2f3ddc8dc10183036f4a965c4215e use plugin display name for node config header

Tests

New test failures 3
Status Test View job Duration
Collapse Failed DataPipelineTest co.cask.cdap.datapipeline.DataPipelineTest History
Unit Test Job 2 secs
co.cask.cdap.common.NamespaceCannotBeDeletedException: 'namespace:default' could not be deleted. Reason: Some programs are currently running in namespace 'namespace:default', please stop them before deleting namespace
	at co.cask.cdap.internal.app.namespace.DefaultNamespaceAdmin.delete(DefaultNamespaceAdmin.java:270)
	at co.cask.cdap.test.TestBase.finish(TestBase.java:511)
	at sun.reflect.NativeMethodAccessorImpl.invoke0(Native Method)
	at sun.reflect.NativeMethodAccessorImpl.invoke(NativeMethodAccessorImpl.java:62)
	at sun.reflect.DelegatingMethodAccessorImpl.invoke(DelegatingMethodAccessorImpl.java:43)
	at java.lang.reflect.Method.invoke(Method.java:498)
	at org.junit.runners.model.FrameworkMethod$1.runReflectiveCall(FrameworkMethod.java:47)
(31 more lines...)
Collapse Failed DataPipelineTest testNestedCondition History
Unit Test Job 5 mins
java.util.concurrent.TimeoutException: Timeout occurred. Expected true but found false.
	at co.cask.cdap.common.utils.Tasks.waitFor(Tasks.java:70)
	at co.cask.cdap.common.utils.Tasks.waitFor(Tasks.java:91)
	at co.cask.cdap.common.utils.Tasks.waitFor(Tasks.java:130)
	at co.cask.cdap.test.AbstractProgramManager.waitForRuns(AbstractProgramManager.java:81)
	at co.cask.cdap.test.AbstractProgramManager.waitForRun(AbstractProgramManager.java:75)
	at co.cask.cdap.datapipeline.DataPipelineTest.testNestedCondition(DataPipelineTest.java:1387)
	at co.cask.cdap.datapipeline.DataPipelineTest.testNestedCondition(DataPipelineTest.java:1312)
(48 more lines...)
Collapse Failed Spark2Test testScalaSparkWithObjectStore History
Unit Test Job 1 min
java.util.concurrent.TimeoutException: Timeout occurred. Expected true but found false.
	at co.cask.cdap.common.utils.Tasks.waitFor(Tasks.java:70)
	at co.cask.cdap.common.utils.Tasks.waitFor(Tasks.java:91)
	at co.cask.cdap.common.utils.Tasks.waitFor(Tasks.java:130)
	at co.cask.cdap.test.AbstractProgramManager.waitForStopped(AbstractProgramManager.java:87)
	at co.cask.cdap.spark.Spark2Test.testScalaSparkWithObjectStore(Spark2Test.java:167)
	at sun.reflect.NativeMethodAccessorImpl.invoke0(Native Method)
	at sun.reflect.NativeMethodAccessorImpl.invoke(NativeMethodAccessorImpl.java:62)
(47 more lines...)

JIRA issues

IssueDescriptionStatus
Unknown Issue TypeCDAP-12957Could not obtain issue details from JIRA