Build #500

Build: #500 failed Child of CDAP-DRC-3931

Build result summary

Details

Completed
Duration
56 minutes
Labels
None
Agent
bamboo-agent01
Revision
9fe8f507187fd8e539166854b0a802cc5b4392e2 9fe8f507187fd8e539166854b0a802cc5b4392e2
Total tests
1765
Fixed in
#501 (Child of CDAP-DRC-3932)

Responsible

No one has taken responsibility for this failure

Code commits

Author Commit Message Commit date
Shankar <gowrishankar1988@gmail.com> Shankar <gowrishankar1988@gmail.com> 9fe8f507187fd8e539166854b0a802cc5b4392e2 9fe8f507187fd8e539166854b0a802cc5b4392e2 Merge pull request #10487 from caskdata/fix/metrics-processor-flaky-test
CDAP-13609 fix metrics processor flaky test
shankar <shankarselvam@google.com> shankar <shankarselvam@google.com> e4012fb4c3bdfa373d5365265ea154b9e7db68c5 e4012fb4c3bdfa373d5365265ea154b9e7db68c5 CDAP-13609 fix flaky test, publish dummy metric to force topic level delays to be published

Tests

New test failures 1
Status Test View job Duration
Collapse Failed LocalPluginFinderTest co.cask.cdap.internal.app.runtime.artifact.LocalPluginFinderTest History
Unit Test Job < 1 sec
com.google.common.util.concurrent.UncheckedExecutionException: java.util.concurrent.ExecutionException: java.lang.RuntimeException: org.apache.tephra.TransactionFailureException: Exception raised from TxRunnable.run() co.cask.cdap.api.Transactionals$$Lambda$38/1320821372@457a70b0
	at com.google.common.util.concurrent.Futures.wrapAndThrowUnchecked(Futures.java:1015)
	at com.google.common.util.concurrent.Futures.getUnchecked(Futures.java:1001)
	at com.google.common.util.concurrent.AbstractService.startAndWait(AbstractService.java:220)
	at com.google.common.util.concurrent.AbstractIdleService.startAndWait(AbstractIdleService.java:106)
	at co.cask.cdap.internal.app.services.http.AppFabricTestBase.initializeAndStartServices(AppFabricTestBase.java:241)
	at co.cask.cdap.internal.app.services.http.AppFabricTestBase.beforeClass(AppFabricTestBase.java:216)
	at sun.reflect.NativeMethodAccessorImpl.invoke0(Native Method)
(91 more lines...)

JIRA issues

IssueDescriptionStatus
Unknown Issue TypeCDAP-13609Could not obtain issue details from JIRA