Build #461

Build: #461 failed Child of CDAP-DRC-3855

Build result summary

Details

Completed
Duration
148 minutes
Labels
None
Agent
bamboo-agent03
Revision
4221cdbc1357f71caa6a49eb8f36c7e6f24b9fa3 4221cdbc1357f71caa6a49eb8f36c7e6f24b9fa3
Total tests
2292
Fixed in
#462 (Child of CDAP-DRC-3856)

Responsible

No one has taken responsibility for this failure

Code commits

Author Commit Message Commit date
Terence Yim <885032+chtyim@users.noreply.github.com> Terence Yim <885032+chtyim@users.noreply.github.com> 4221cdbc1357f71caa6a49eb8f36c7e6f24b9fa3 4221cdbc1357f71caa6a49eb8f36c7e6f24b9fa3 Merge pull request #10188 from caskdata/feature/CDAP-13252-ssl-auth
(CDAP-13252) Enabling two-ways HTTPS authentication for runtime monitor
Chengfeng Mao <chengfeng@google.com> Chengfeng Mao <chengfeng@google.com> 0e5403f5d6eb55360e1e68d0be0a5249c2735c8c 0e5403f5d6eb55360e1e68d0be0a5249c2735c8c Merge pull request #10187 from caskdata/feature/CDAP-13305-report-app-spark1
[CDAP-13305] Report app spark1 compatibility
chengfeng <chengfeng@google.com> chengfeng <chengfeng@google.com> 922079520a410c7ff0d923e7ea44f64a193e182c m 922079520a410c7ff0d923e7ea44f64a193e182c [CDAP-13305] Program report app spark1 compatibility
Edwin Elia <edwinelia@google.com> Edwin Elia <edwinelia@google.com> 158ce14b339fc3585a2b3b34b053c1349d659224 158ce14b339fc3585a2b3b34b053c1349d659224 Merge pull request #10209 from caskdata/feature-ui/CDAP-13510-fll-time-range-picker
[CDAP-13510] add basic time range picker
Edwin Elia <edwinelia@google.com> Edwin Elia <edwinelia@google.com> 766452d0dff9ee23be31cdd470efbb78aca84ef5 766452d0dff9ee23be31cdd470efbb78aca84ef5 add basic time range picker

Tests

New test failures 1
Status Test View job Duration
Collapse Failed StreamViewHttpHandlerTest co.cask.cdap.gateway.handlers.StreamViewHttpHandlerTest History
Unit Test Job < 1 sec
com.google.common.util.concurrent.UncheckedExecutionException: java.util.concurrent.ExecutionException: java.lang.RuntimeException: org.apache.tephra.TransactionNotInProgressException: canCommit() is called for transaction 1529351135240000000 that is not in progress (it is known to be invalid)
	at com.google.common.util.concurrent.Futures.wrapAndThrowUnchecked(Futures.java:1015)
	at com.google.common.util.concurrent.Futures.getUnchecked(Futures.java:1001)
	at com.google.common.util.concurrent.AbstractService.startAndWait(AbstractService.java:220)
	at com.google.common.util.concurrent.AbstractIdleService.startAndWait(AbstractIdleService.java:106)
	at co.cask.cdap.gateway.GatewayTestBase.startGateway(GatewayTestBase.java:206)
	at co.cask.cdap.gateway.GatewayTestBase.beforeClass(GatewayTestBase.java:142)
	at sun.reflect.NativeMethodAccessorImpl.invoke0(Native Method)
(61 more lines...)

JIRA issues

IssueDescriptionStatus
Unknown Issue TypeCDAP-13252Could not obtain issue details from JIRA
Unknown Issue TypeCDAP-13305Could not obtain issue details from JIRA
Unknown Issue TypeCDAP-13510Could not obtain issue details from JIRA