Build #262

Build: #262 failed Child of CDAP-DRC-3583

Build result summary

Details

Completed
Duration
190 minutes
Labels
None
Agent
bamboo-agent02
Revision
b269725d7098e43656ed6659e4b4de21fc11a4af b269725d7098e43656ed6659e4b4de21fc11a4af
Total tests
2338
Fixed in
#263 (Child of CDAP-DRC-3584)

Responsible

Code commits

Author Commit Message Commit date
Sreevatsan Raman Sreevatsan Raman b269725d7098e43656ed6659e4b4de21fc11a4af b269725d7098e43656ed6659e4b4de21fc11a4af Merge pull request #9794 from caskdata/feature/replace-getting-started
Fix Warnings
sreevatsanraman <sreevatsan@gmail.com> sreevatsanraman <sreevatsan@gmail.com> 32089b8608ae9fa1f0b1d93581c130da0259cdb6 m 32089b8608ae9fa1f0b1d93581c130da0259cdb6 Fix errors
Shankar <gowrishankar1988@gmail.com> Shankar <gowrishankar1988@gmail.com> 8a7aa4571f0622d3dbbed13aef564bf8b0f88120 8a7aa4571f0622d3dbbed13aef564bf8b0f88120 Merge pull request #9790 from caskdata/feature/cdap-test-deprecations
Feature/cdap test deprecations
Shankar Selvam Shankar Selvam 73fcddb28468ac2b3c2c40706647e0fef2a83285 m 73fcddb28468ac2b3c2c40706647e0fef2a83285 remove deprecated api test base remove method in TestBase which uses Id.Application and corrensponding changes to use ApplicationId instead cli deprecations, integration test base deprecations removal

Tests

New test failures 50
Status Test View job Duration
Collapse Failed ApplicationClientTestRun testAll History
Unit Test Job < 1 sec
java.lang.AssertionError: expected:<0> but was:<1>
	at org.junit.Assert.fail(Assert.java:88)
	at org.junit.Assert.failNotEquals(Assert.java:743)
	at org.junit.Assert.assertEquals(Assert.java:118)
	at org.junit.Assert.assertEquals(Assert.java:555)
	at org.junit.Assert.assertEquals(Assert.java:542)
	at co.cask.cdap.client.ApplicationClientTestRun.testAll(ApplicationClientTestRun.java:109)
	at sun.reflect.NativeMethodAccessorImpl.invoke0(Native Method)
(57 more lines...)
Collapse Failed ApplicationClientTestRun testAppUpdate History
Unit Test Job 56 secs
java.io.IOException: 503: Service 'Core scheduler' is not available. Please wait until it is up and running.
	at co.cask.cdap.client.util.RESTClient.execute(RESTClient.java:132)
	at co.cask.cdap.client.util.RESTClient.execute(RESTClient.java:74)
	at co.cask.cdap.client.ApplicationClient.delete(ApplicationClient.java:329)
	at co.cask.cdap.client.ApplicationClientTestRun.testAppUpdate(ApplicationClientTestRun.java:242)
	at sun.reflect.NativeMethodAccessorImpl.invoke0(Native Method)
	at sun.reflect.NativeMethodAccessorImpl.invoke(NativeMethodAccessorImpl.java:62)
	at sun.reflect.DelegatingMethodAccessorImpl.invoke(DelegatingMethodAccessorImpl.java:43)
(55 more lines...)
Collapse Failed ApplicationClientTestRun testAppConfig History
Unit Test Job < 1 sec
java.io.IOException: Service 'Core scheduler' is not available. Please wait until it is up and running.
	at co.cask.cdap.client.util.RESTClient.upload(RESTClient.java:160)
	at co.cask.cdap.client.ApplicationClient.deployApp(ApplicationClient.java:671)
	at co.cask.cdap.client.ApplicationClient.deploy(ApplicationClient.java:551)
	at co.cask.cdap.client.ApplicationClient.deploy(ApplicationClient.java:527)
	at co.cask.cdap.client.ApplicationClient.deploy(ApplicationClient.java:581)
	at co.cask.cdap.client.ApplicationClientTestRun.testAppConfig(ApplicationClientTestRun.java:153)
	at sun.reflect.NativeMethodAccessorImpl.invoke0(Native Method)
(57 more lines...)
Collapse Failed ApplicationClientTestRun testArtifactFilter History
Unit Test Job 1 min
java.io.IOException: 503: Service 'Core scheduler' is not available. Please wait until it is up and running.
	at co.cask.cdap.client.util.RESTClient.execute(RESTClient.java:132)
	at co.cask.cdap.client.util.RESTClient.execute(RESTClient.java:74)
	at co.cask.cdap.client.ApplicationClient.deleteAll(ApplicationClient.java:356)
	at co.cask.cdap.client.ApplicationClientTestRun.testArtifactFilter(ApplicationClientTestRun.java:319)
	at sun.reflect.NativeMethodAccessorImpl.invoke0(Native Method)
	at sun.reflect.NativeMethodAccessorImpl.invoke(NativeMethodAccessorImpl.java:62)
	at sun.reflect.DelegatingMethodAccessorImpl.invoke(DelegatingMethodAccessorImpl.java:43)
(55 more lines...)
Collapse Failed ApplicationClientTestRun testDeleteAll History
Unit Test Job < 1 sec
java.lang.AssertionError: expected:<0> but was:<1>
	at org.junit.Assert.fail(Assert.java:88)
	at org.junit.Assert.failNotEquals(Assert.java:743)
	at org.junit.Assert.assertEquals(Assert.java:118)
	at org.junit.Assert.assertEquals(Assert.java:555)
	at org.junit.Assert.assertEquals(Assert.java:542)
	at co.cask.cdap.client.ApplicationClientTestRun.testDeleteAll(ApplicationClientTestRun.java:333)
	at sun.reflect.NativeMethodAccessorImpl.invoke0(Native Method)
(57 more lines...)
Collapse Failed LineageTestRun testFlowLineage History
Unit Test Job 2 secs
java.io.IOException: 409: 'namespace:testFlowLineage' could not be deleted. Reason: Service 'Core scheduler' is not available. Please wait until it is up and running.
	at co.cask.cdap.client.util.RESTClient.execute(RESTClient.java:132)
	at co.cask.cdap.client.util.RESTClient.execute(RESTClient.java:69)
	at co.cask.cdap.client.NamespaceClient.execute(NamespaceClient.java:56)
	at co.cask.cdap.common.namespace.AbstractNamespaceClient.delete(AbstractNamespaceClient.java:42)
	at co.cask.cdap.client.LineageTestRun.testFlowLineage(LineageTestRun.java:190)
	at sun.reflect.NativeMethodAccessorImpl.invoke0(Native Method)
	at sun.reflect.NativeMethodAccessorImpl.invoke(NativeMethodAccessorImpl.java:62)
(55 more lines...)
Collapse Failed LineageTestRun testAllProgramsLineage History
Unit Test Job 10 secs
java.io.IOException: 409: 'namespace:testAllProgramsLineage' could not be deleted. Reason: Service 'Core scheduler' is not available. Please wait until it is up and running.
	at co.cask.cdap.client.util.RESTClient.execute(RESTClient.java:132)
	at co.cask.cdap.client.util.RESTClient.execute(RESTClient.java:69)
	at co.cask.cdap.client.NamespaceClient.execute(NamespaceClient.java:56)
	at co.cask.cdap.common.namespace.AbstractNamespaceClient.delete(AbstractNamespaceClient.java:42)
	at co.cask.cdap.client.LineageTestRun.testAllProgramsLineage(LineageTestRun.java:325)
	at sun.reflect.NativeMethodAccessorImpl.invoke0(Native Method)
	at sun.reflect.NativeMethodAccessorImpl.invoke(NativeMethodAccessorImpl.java:62)
(55 more lines...)
Collapse Failed MetadataHttpHandlerTestRun testMetadata History
Unit Test Job 51 secs
co.cask.cdap.common.ArtifactAlreadyExistsException: Artifact artifact:default.AppWithDataset.1.0.0 already exists.
	at co.cask.cdap.client.ArtifactClient.add(ArtifactClient.java:914)
	at co.cask.cdap.client.ArtifactClient.add(ArtifactClient.java:833)
	at co.cask.cdap.client.ArtifactClient.add(ArtifactClient.java:736)
	at co.cask.cdap.client.MetadataTestBase.addAppArtifact(MetadataTestBase.java:80)
	at co.cask.cdap.client.MetadataHttpHandlerTestRun.before(MetadataHttpHandlerTestRun.java:111)
	at sun.reflect.NativeMethodAccessorImpl.invoke0(Native Method)
	at sun.reflect.NativeMethodAccessorImpl.invoke(NativeMethodAccessorImpl.java:62)
(55 more lines...)
Collapse Failed MetadataHttpHandlerTestRun testSearchMetadataDelete History
Unit Test Job 51 secs
co.cask.cdap.common.ArtifactAlreadyExistsException: Artifact artifact:default.AppWithDataset.1.0.0 already exists.
	at co.cask.cdap.client.ArtifactClient.add(ArtifactClient.java:914)
	at co.cask.cdap.client.ArtifactClient.add(ArtifactClient.java:833)
	at co.cask.cdap.client.ArtifactClient.add(ArtifactClient.java:736)
	at co.cask.cdap.client.MetadataTestBase.addAppArtifact(MetadataTestBase.java:80)
	at co.cask.cdap.client.MetadataHttpHandlerTestRun.before(MetadataHttpHandlerTestRun.java:111)
	at sun.reflect.GeneratedMethodAccessor17.invoke(Unknown Source)
	at sun.reflect.DelegatingMethodAccessorImpl.invoke(DelegatingMethodAccessorImpl.java:43)
(54 more lines...)
Collapse Failed MetadataHttpHandlerTestRun testDeletedProgramHandlerStage History
Unit Test Job 51 secs
co.cask.cdap.common.ArtifactAlreadyExistsException: Artifact artifact:default.AppWithDataset.1.0.0 already exists.
	at co.cask.cdap.client.ArtifactClient.add(ArtifactClient.java:914)
	at co.cask.cdap.client.ArtifactClient.add(ArtifactClient.java:833)
	at co.cask.cdap.client.ArtifactClient.add(ArtifactClient.java:736)
	at co.cask.cdap.client.MetadataTestBase.addAppArtifact(MetadataTestBase.java:80)
	at co.cask.cdap.client.MetadataHttpHandlerTestRun.before(MetadataHttpHandlerTestRun.java:111)
	at sun.reflect.NativeMethodAccessorImpl.invoke0(Native Method)
	at sun.reflect.NativeMethodAccessorImpl.invoke(NativeMethodAccessorImpl.java:62)
(55 more lines...)
Collapse Failed MetadataHttpHandlerTestRun testInvalidParams History
Unit Test Job 51 secs
co.cask.cdap.common.ArtifactAlreadyExistsException: Artifact artifact:default.AppWithDataset.1.0.0 already exists.
	at co.cask.cdap.client.ArtifactClient.add(ArtifactClient.java:914)
	at co.cask.cdap.client.ArtifactClient.add(ArtifactClient.java:833)
	at co.cask.cdap.client.ArtifactClient.add(ArtifactClient.java:736)
	at co.cask.cdap.client.MetadataTestBase.addAppArtifact(MetadataTestBase.java:80)
	at co.cask.cdap.client.MetadataHttpHandlerTestRun.before(MetadataHttpHandlerTestRun.java:111)
	at sun.reflect.GeneratedMethodAccessor17.invoke(Unknown Source)
	at sun.reflect.DelegatingMethodAccessorImpl.invoke(DelegatingMethodAccessorImpl.java:43)
(54 more lines...)
Collapse Failed MetadataHttpHandlerTestRun testExploreSystemTags History
Unit Test Job 51 secs
co.cask.cdap.common.ArtifactAlreadyExistsException: Artifact artifact:default.AppWithDataset.1.0.0 already exists.
	at co.cask.cdap.client.ArtifactClient.add(ArtifactClient.java:914)
	at co.cask.cdap.client.ArtifactClient.add(ArtifactClient.java:833)
	at co.cask.cdap.client.ArtifactClient.add(ArtifactClient.java:736)
	at co.cask.cdap.client.MetadataTestBase.addAppArtifact(MetadataTestBase.java:80)
	at co.cask.cdap.client.MetadataHttpHandlerTestRun.before(MetadataHttpHandlerTestRun.java:111)
	at sun.reflect.NativeMethodAccessorImpl.invoke0(Native Method)
	at sun.reflect.NativeMethodAccessorImpl.invoke(NativeMethodAccessorImpl.java:62)
(55 more lines...)
Collapse Failed MetadataHttpHandlerTestRun testSearchMetadata History
Unit Test Job 51 secs
co.cask.cdap.common.ArtifactAlreadyExistsException: Artifact artifact:default.AppWithDataset.1.0.0 already exists.
	at co.cask.cdap.client.ArtifactClient.add(ArtifactClient.java:914)
	at co.cask.cdap.client.ArtifactClient.add(ArtifactClient.java:833)
	at co.cask.cdap.client.ArtifactClient.add(ArtifactClient.java:736)
	at co.cask.cdap.client.MetadataTestBase.addAppArtifact(MetadataTestBase.java:80)
	at co.cask.cdap.client.MetadataHttpHandlerTestRun.before(MetadataHttpHandlerTestRun.java:111)
	at sun.reflect.NativeMethodAccessorImpl.invoke0(Native Method)
	at sun.reflect.NativeMethodAccessorImpl.invoke(NativeMethodAccessorImpl.java:62)
(55 more lines...)
Collapse Failed MetadataHttpHandlerTestRun testSearchResultSorting History
Unit Test Job 52 secs
java.io.IOException: Service 'Core scheduler' is not available. Please wait until it is up and running.
	at co.cask.cdap.client.util.RESTClient.upload(RESTClient.java:160)
	at co.cask.cdap.client.ApplicationClient.deploy(ApplicationClient.java:614)
	at co.cask.cdap.client.MetadataHttpHandlerTestRun.before(MetadataHttpHandlerTestRun.java:115)
	at sun.reflect.NativeMethodAccessorImpl.invoke0(Native Method)
	at sun.reflect.NativeMethodAccessorImpl.invoke(NativeMethodAccessorImpl.java:62)
	at sun.reflect.DelegatingMethodAccessorImpl.invoke(DelegatingMethodAccessorImpl.java:43)
	at java.lang.reflect.Method.invoke(Method.java:498)
(53 more lines...)
Collapse Failed MetadataHttpHandlerTestRun testInvalidEntities History
Unit Test Job 51 secs
co.cask.cdap.common.ArtifactAlreadyExistsException: Artifact artifact:default.AppWithDataset.1.0.0 already exists.
	at co.cask.cdap.client.ArtifactClient.add(ArtifactClient.java:914)
	at co.cask.cdap.client.ArtifactClient.add(ArtifactClient.java:833)
	at co.cask.cdap.client.ArtifactClient.add(ArtifactClient.java:736)
	at co.cask.cdap.client.MetadataTestBase.addAppArtifact(MetadataTestBase.java:80)
	at co.cask.cdap.client.MetadataHttpHandlerTestRun.before(MetadataHttpHandlerTestRun.java:111)
	at sun.reflect.GeneratedMethodAccessor17.invoke(Unknown Source)
	at sun.reflect.DelegatingMethodAccessorImpl.invoke(DelegatingMethodAccessorImpl.java:43)
(54 more lines...)
Collapse Failed MetadataHttpHandlerTestRun testSearchMetadataDeleteNamespace History
Unit Test Job 51 secs
co.cask.cdap.common.ArtifactAlreadyExistsException: Artifact artifact:default.AppWithDataset.1.0.0 already exists.
	at co.cask.cdap.client.ArtifactClient.add(ArtifactClient.java:914)
	at co.cask.cdap.client.ArtifactClient.add(ArtifactClient.java:833)
	at co.cask.cdap.client.ArtifactClient.add(ArtifactClient.java:736)
	at co.cask.cdap.client.MetadataTestBase.addAppArtifact(MetadataTestBase.java:80)
	at co.cask.cdap.client.MetadataHttpHandlerTestRun.before(MetadataHttpHandlerTestRun.java:111)
	at sun.reflect.NativeMethodAccessorImpl.invoke0(Native Method)
	at sun.reflect.NativeMethodAccessorImpl.invoke(NativeMethodAccessorImpl.java:62)
(55 more lines...)
Collapse Failed MetadataHttpHandlerTestRun testSearchResultPagination History
Unit Test Job 51 secs
co.cask.cdap.common.ArtifactAlreadyExistsException: Artifact artifact:default.AppWithDataset.1.0.0 already exists.
	at co.cask.cdap.client.ArtifactClient.add(ArtifactClient.java:914)
	at co.cask.cdap.client.ArtifactClient.add(ArtifactClient.java:833)
	at co.cask.cdap.client.ArtifactClient.add(ArtifactClient.java:736)
	at co.cask.cdap.client.MetadataTestBase.addAppArtifact(MetadataTestBase.java:80)
	at co.cask.cdap.client.MetadataHttpHandlerTestRun.before(MetadataHttpHandlerTestRun.java:111)
	at sun.reflect.GeneratedMethodAccessor17.invoke(Unknown Source)
	at sun.reflect.DelegatingMethodAccessorImpl.invoke(DelegatingMethodAccessorImpl.java:43)
(54 more lines...)
Collapse Failed MetadataHttpHandlerTestRun testInvalidSearchParams History
Unit Test Job 51 secs
co.cask.cdap.common.ArtifactAlreadyExistsException: Artifact artifact:default.AppWithDataset.1.0.0 already exists.
	at co.cask.cdap.client.ArtifactClient.add(ArtifactClient.java:914)
	at co.cask.cdap.client.ArtifactClient.add(ArtifactClient.java:833)
	at co.cask.cdap.client.ArtifactClient.add(ArtifactClient.java:736)
	at co.cask.cdap.client.MetadataTestBase.addAppArtifact(MetadataTestBase.java:80)
	at co.cask.cdap.client.MetadataHttpHandlerTestRun.before(MetadataHttpHandlerTestRun.java:111)
	at sun.reflect.NativeMethodAccessorImpl.invoke0(Native Method)
	at sun.reflect.NativeMethodAccessorImpl.invoke(NativeMethodAccessorImpl.java:62)
(55 more lines...)
Collapse Failed MetadataHttpHandlerTestRun testSearchUsingSystemMetadata History
Unit Test Job 51 secs
co.cask.cdap.common.ArtifactAlreadyExistsException: Artifact artifact:default.AppWithDataset.1.0.0 already exists.
	at co.cask.cdap.client.ArtifactClient.add(ArtifactClient.java:914)
	at co.cask.cdap.client.ArtifactClient.add(ArtifactClient.java:833)
	at co.cask.cdap.client.ArtifactClient.add(ArtifactClient.java:736)
	at co.cask.cdap.client.MetadataTestBase.addAppArtifact(MetadataTestBase.java:80)
	at co.cask.cdap.client.MetadataHttpHandlerTestRun.before(MetadataHttpHandlerTestRun.java:111)
	at sun.reflect.NativeMethodAccessorImpl.invoke0(Native Method)
	at sun.reflect.NativeMethodAccessorImpl.invoke(NativeMethodAccessorImpl.java:62)
(55 more lines...)
Collapse Failed MetadataHttpHandlerTestRun testSystemMetadataRetrieval History
Unit Test Job 51 secs
co.cask.cdap.common.ArtifactAlreadyExistsException: Artifact artifact:default.AppWithDataset.1.0.0 already exists.
	at co.cask.cdap.client.ArtifactClient.add(ArtifactClient.java:914)
	at co.cask.cdap.client.ArtifactClient.add(ArtifactClient.java:833)
	at co.cask.cdap.client.ArtifactClient.add(ArtifactClient.java:736)
	at co.cask.cdap.client.MetadataTestBase.addAppArtifact(MetadataTestBase.java:80)
	at co.cask.cdap.client.MetadataHttpHandlerTestRun.before(MetadataHttpHandlerTestRun.java:111)
	at sun.reflect.GeneratedMethodAccessor17.invoke(Unknown Source)
	at sun.reflect.DelegatingMethodAccessorImpl.invoke(DelegatingMethodAccessorImpl.java:43)
(54 more lines...)
Collapse Failed MetadataHttpHandlerTestRun testInvalidTags History
Unit Test Job 51 secs
co.cask.cdap.common.ArtifactAlreadyExistsException: Artifact artifact:default.AppWithDataset.1.0.0 already exists.
	at co.cask.cdap.client.ArtifactClient.add(ArtifactClient.java:914)
	at co.cask.cdap.client.ArtifactClient.add(ArtifactClient.java:833)
	at co.cask.cdap.client.ArtifactClient.add(ArtifactClient.java:736)
	at co.cask.cdap.client.MetadataTestBase.addAppArtifact(MetadataTestBase.java:80)
	at co.cask.cdap.client.MetadataHttpHandlerTestRun.before(MetadataHttpHandlerTestRun.java:111)
	at sun.reflect.NativeMethodAccessorImpl.invoke0(Native Method)
	at sun.reflect.NativeMethodAccessorImpl.invoke(NativeMethodAccessorImpl.java:62)
(55 more lines...)
Collapse Failed MetadataHttpHandlerTestRun testSearchResultPaginationWithTargetType History
Unit Test Job 51 secs
co.cask.cdap.common.ArtifactAlreadyExistsException: Artifact artifact:default.AppWithDataset.1.0.0 already exists.
	at co.cask.cdap.client.ArtifactClient.add(ArtifactClient.java:914)
	at co.cask.cdap.client.ArtifactClient.add(ArtifactClient.java:833)
	at co.cask.cdap.client.ArtifactClient.add(ArtifactClient.java:736)
	at co.cask.cdap.client.MetadataTestBase.addAppArtifact(MetadataTestBase.java:80)
	at co.cask.cdap.client.MetadataHttpHandlerTestRun.before(MetadataHttpHandlerTestRun.java:111)
	at sun.reflect.NativeMethodAccessorImpl.invoke0(Native Method)
	at sun.reflect.NativeMethodAccessorImpl.invoke(NativeMethodAccessorImpl.java:62)
(55 more lines...)
Collapse Failed MetadataHttpHandlerTestRun testScopeQueryParam History
Unit Test Job 51 secs
co.cask.cdap.common.ArtifactAlreadyExistsException: Artifact artifact:default.AppWithDataset.1.0.0 already exists.
	at co.cask.cdap.client.ArtifactClient.add(ArtifactClient.java:914)
	at co.cask.cdap.client.ArtifactClient.add(ArtifactClient.java:833)
	at co.cask.cdap.client.ArtifactClient.add(ArtifactClient.java:736)
	at co.cask.cdap.client.MetadataTestBase.addAppArtifact(MetadataTestBase.java:80)
	at co.cask.cdap.client.MetadataHttpHandlerTestRun.before(MetadataHttpHandlerTestRun.java:111)
	at sun.reflect.NativeMethodAccessorImpl.invoke0(Native Method)
	at sun.reflect.NativeMethodAccessorImpl.invoke(NativeMethodAccessorImpl.java:62)
(55 more lines...)
Collapse Failed MetadataHttpHandlerTestRun testInvalidProperties History
Unit Test Job 51 secs
co.cask.cdap.common.ArtifactAlreadyExistsException: Artifact artifact:default.AppWithDataset.1.0.0 already exists.
	at co.cask.cdap.client.ArtifactClient.add(ArtifactClient.java:914)
	at co.cask.cdap.client.ArtifactClient.add(ArtifactClient.java:833)
	at co.cask.cdap.client.ArtifactClient.add(ArtifactClient.java:736)
	at co.cask.cdap.client.MetadataTestBase.addAppArtifact(MetadataTestBase.java:80)
	at co.cask.cdap.client.MetadataHttpHandlerTestRun.before(MetadataHttpHandlerTestRun.java:111)
	at sun.reflect.NativeMethodAccessorImpl.invoke0(Native Method)
	at sun.reflect.NativeMethodAccessorImpl.invoke(NativeMethodAccessorImpl.java:62)
(55 more lines...)
Collapse Failed MetadataHttpHandlerTestRun testSystemScopeArtifacts History
Unit Test Job 51 secs
co.cask.cdap.common.ArtifactAlreadyExistsException: Artifact artifact:default.AppWithDataset.1.0.0 already exists.
	at co.cask.cdap.client.ArtifactClient.add(ArtifactClient.java:914)
	at co.cask.cdap.client.ArtifactClient.add(ArtifactClient.java:833)
	at co.cask.cdap.client.ArtifactClient.add(ArtifactClient.java:736)
	at co.cask.cdap.client.MetadataTestBase.addAppArtifact(MetadataTestBase.java:80)
	at co.cask.cdap.client.MetadataHttpHandlerTestRun.before(MetadataHttpHandlerTestRun.java:111)
	at sun.reflect.NativeMethodAccessorImpl.invoke0(Native Method)
	at sun.reflect.NativeMethodAccessorImpl.invoke(NativeMethodAccessorImpl.java:62)
(55 more lines...)
Collapse Failed MetadataHttpHandlerTestRun testTags History
Unit Test Job 51 secs
co.cask.cdap.common.ArtifactAlreadyExistsException: Artifact artifact:default.AppWithDataset.1.0.0 already exists.
	at co.cask.cdap.client.ArtifactClient.add(ArtifactClient.java:914)
	at co.cask.cdap.client.ArtifactClient.add(ArtifactClient.java:833)
	at co.cask.cdap.client.ArtifactClient.add(ArtifactClient.java:736)
	at co.cask.cdap.client.MetadataTestBase.addAppArtifact(MetadataTestBase.java:80)
	at co.cask.cdap.client.MetadataHttpHandlerTestRun.before(MetadataHttpHandlerTestRun.java:111)
	at sun.reflect.NativeMethodAccessorImpl.invoke0(Native Method)
	at sun.reflect.NativeMethodAccessorImpl.invoke(NativeMethodAccessorImpl.java:62)
(55 more lines...)
Collapse Failed MetadataHttpHandlerTestRun testProperties History
Unit Test Job 51 secs
co.cask.cdap.common.ArtifactAlreadyExistsException: Artifact artifact:default.AppWithDataset.1.0.0 already exists.
	at co.cask.cdap.client.ArtifactClient.add(ArtifactClient.java:914)
	at co.cask.cdap.client.ArtifactClient.add(ArtifactClient.java:833)
	at co.cask.cdap.client.ArtifactClient.add(ArtifactClient.java:736)
	at co.cask.cdap.client.MetadataTestBase.addAppArtifact(MetadataTestBase.java:80)
	at co.cask.cdap.client.MetadataHttpHandlerTestRun.before(MetadataHttpHandlerTestRun.java:111)
	at sun.reflect.NativeMethodAccessorImpl.invoke0(Native Method)
	at sun.reflect.NativeMethodAccessorImpl.invoke(NativeMethodAccessorImpl.java:62)
(55 more lines...)
Collapse Failed MetadataHttpHandlerTestRun testDeleteApplication History
Unit Test Job 51 secs
co.cask.cdap.common.ArtifactAlreadyExistsException: Artifact artifact:default.AppWithDataset.1.0.0 already exists.
	at co.cask.cdap.client.ArtifactClient.add(ArtifactClient.java:914)
	at co.cask.cdap.client.ArtifactClient.add(ArtifactClient.java:833)
	at co.cask.cdap.client.ArtifactClient.add(ArtifactClient.java:736)
	at co.cask.cdap.client.MetadataTestBase.addAppArtifact(MetadataTestBase.java:80)
	at co.cask.cdap.client.MetadataHttpHandlerTestRun.before(MetadataHttpHandlerTestRun.java:111)
	at sun.reflect.NativeMethodAccessorImpl.invoke0(Native Method)
	at sun.reflect.NativeMethodAccessorImpl.invoke(NativeMethodAccessorImpl.java:62)
(55 more lines...)
Collapse Failed MetadataHttpHandlerTestRun testSearchTargetType History
Unit Test Job 51 secs
co.cask.cdap.common.ArtifactAlreadyExistsException: Artifact artifact:default.AppWithDataset.1.0.0 already exists.
	at co.cask.cdap.client.ArtifactClient.add(ArtifactClient.java:914)
	at co.cask.cdap.client.ArtifactClient.add(ArtifactClient.java:833)
	at co.cask.cdap.client.ArtifactClient.add(ArtifactClient.java:736)
	at co.cask.cdap.client.MetadataTestBase.addAppArtifact(MetadataTestBase.java:80)
	at co.cask.cdap.client.MetadataHttpHandlerTestRun.before(MetadataHttpHandlerTestRun.java:111)
	at sun.reflect.GeneratedMethodAccessor17.invoke(Unknown Source)
	at sun.reflect.DelegatingMethodAccessorImpl.invoke(DelegatingMethodAccessorImpl.java:43)
(54 more lines...)
Collapse Failed MetricsClientTestRun testAll History
Unit Test Job 2 secs
java.io.IOException: Service 'Core scheduler' is not available. Please wait until it is up and running.
	at co.cask.cdap.client.util.RESTClient.upload(RESTClient.java:160)
	at co.cask.cdap.client.ApplicationClient.deployApp(ApplicationClient.java:671)
	at co.cask.cdap.client.ApplicationClient.deploy(ApplicationClient.java:497)
	at co.cask.cdap.client.MetricsClientTestRun.testAll(MetricsClientTestRun.java:65)
	at sun.reflect.NativeMethodAccessorImpl.invoke0(Native Method)
	at sun.reflect.NativeMethodAccessorImpl.invoke(NativeMethodAccessorImpl.java:62)
	at sun.reflect.DelegatingMethodAccessorImpl.invoke(DelegatingMethodAccessorImpl.java:43)
(54 more lines...)
Collapse Failed NamespaceClientTestRun testDeleteAll History
Unit Test Job < 1 sec
java.io.IOException: 409: 'namespace:default' could not be deleted. Reason: Service 'Core scheduler' is not available. Please wait until it is up and running.
	at co.cask.cdap.client.util.RESTClient.execute(RESTClient.java:132)
	at co.cask.cdap.client.util.RESTClient.execute(RESTClient.java:69)
	at co.cask.cdap.client.NamespaceClient.execute(NamespaceClient.java:56)
	at co.cask.cdap.common.namespace.AbstractNamespaceClient.delete(AbstractNamespaceClient.java:42)
	at co.cask.cdap.common.namespace.AbstractNamespaceClient.deleteAll(AbstractNamespaceClient.java:106)
	at co.cask.cdap.client.NamespaceClientTestRun.testDeleteAll(NamespaceClientTestRun.java:119)
	at sun.reflect.NativeMethodAccessorImpl.invoke0(Native Method)
(56 more lines...)
Collapse Failed NamespaceClientTestRun testNamespaces History
Unit Test Job < 1 sec
java.io.IOException: 409: 'namespace:default' could not be deleted. Reason: Service 'Core scheduler' is not available. Please wait until it is up and running.
	at co.cask.cdap.client.util.RESTClient.execute(RESTClient.java:132)
	at co.cask.cdap.client.util.RESTClient.execute(RESTClient.java:69)
	at co.cask.cdap.client.NamespaceClient.execute(NamespaceClient.java:56)
	at co.cask.cdap.common.namespace.AbstractNamespaceClient.delete(AbstractNamespaceClient.java:42)
	at co.cask.cdap.client.NamespaceClientTestRun.verifyReservedDelete(NamespaceClientTestRun.java:147)
	at co.cask.cdap.client.NamespaceClientTestRun.testNamespaces(NamespaceClientTestRun.java:59)
	at sun.reflect.NativeMethodAccessorImpl.invoke0(Native Method)
(56 more lines...)
Collapse Failed PreferencesClientTestRun testProgramAPI History
Unit Test Job < 1 sec
java.io.IOException: Service 'Core scheduler' is not available. Please wait until it is up and running.
	at co.cask.cdap.client.util.RESTClient.upload(RESTClient.java:160)
	at co.cask.cdap.client.ApplicationClient.deployApp(ApplicationClient.java:671)
	at co.cask.cdap.client.ApplicationClient.deploy(ApplicationClient.java:497)
	at co.cask.cdap.client.PreferencesClientTestRun.testProgramAPI(PreferencesClientTestRun.java:86)
	at sun.reflect.NativeMethodAccessorImpl.invoke0(Native Method)
	at sun.reflect.NativeMethodAccessorImpl.invoke(NativeMethodAccessorImpl.java:62)
	at sun.reflect.DelegatingMethodAccessorImpl.invoke(DelegatingMethodAccessorImpl.java:43)
(54 more lines...)
Collapse Failed PreferencesClientTestRun testPreferences History
Unit Test Job 2 secs
java.io.IOException: Service 'Core scheduler' is not available. Please wait until it is up and running.
	at co.cask.cdap.client.util.RESTClient.upload(RESTClient.java:160)
	at co.cask.cdap.client.ApplicationClient.deployApp(ApplicationClient.java:671)
	at co.cask.cdap.client.ApplicationClient.deploy(ApplicationClient.java:497)
	at co.cask.cdap.client.PreferencesClientTestRun.testPreferences(PreferencesClientTestRun.java:177)
	at sun.reflect.NativeMethodAccessorImpl.invoke0(Native Method)
	at sun.reflect.NativeMethodAccessorImpl.invoke(NativeMethodAccessorImpl.java:62)
	at sun.reflect.DelegatingMethodAccessorImpl.invoke(DelegatingMethodAccessorImpl.java:43)
(54 more lines...)
Collapse Failed ProgramClientTestRun testBatchProgramCalls History
Unit Test Job 2 secs
java.io.IOException: Service 'Core scheduler' is not available. Please wait until it is up and running.
	at co.cask.cdap.client.util.RESTClient.upload(RESTClient.java:160)
	at co.cask.cdap.client.ApplicationClient.deployApp(ApplicationClient.java:671)
	at co.cask.cdap.client.ApplicationClient.deploy(ApplicationClient.java:497)
	at co.cask.cdap.client.ProgramClientTestRun.testBatchProgramCalls(ProgramClientTestRun.java:81)
	at sun.reflect.NativeMethodAccessorImpl.invoke0(Native Method)
	at sun.reflect.NativeMethodAccessorImpl.invoke(NativeMethodAccessorImpl.java:62)
	at sun.reflect.DelegatingMethodAccessorImpl.invoke(DelegatingMethodAccessorImpl.java:43)
(54 more lines...)
Collapse Failed ProgramClientTestRun testAll History
Unit Test Job 2 secs
java.io.IOException: Service 'Core scheduler' is not available. Please wait until it is up and running.
	at co.cask.cdap.client.util.RESTClient.upload(RESTClient.java:160)
	at co.cask.cdap.client.ApplicationClient.deployApp(ApplicationClient.java:671)
	at co.cask.cdap.client.ApplicationClient.deploy(ApplicationClient.java:497)
	at co.cask.cdap.client.ProgramClientTestRun.testAll(ProgramClientTestRun.java:162)
	at sun.reflect.NativeMethodAccessorImpl.invoke0(Native Method)
	at sun.reflect.NativeMethodAccessorImpl.invoke(NativeMethodAccessorImpl.java:62)
	at sun.reflect.DelegatingMethodAccessorImpl.invoke(DelegatingMethodAccessorImpl.java:43)
(54 more lines...)
Collapse Failed ScheduleClientTestRun testScheduleChanges History
Unit Test Job 53 secs
java.io.IOException: Service 'Core scheduler' is not available. Please wait until it is up and running.
	at co.cask.cdap.client.util.RESTClient.upload(RESTClient.java:160)
	at co.cask.cdap.client.ApplicationClient.deployApp(ApplicationClient.java:671)
	at co.cask.cdap.client.ApplicationClient.deploy(ApplicationClient.java:497)
	at co.cask.cdap.client.ScheduleClientTestRun.setUp(ScheduleClientTestRun.java:64)
	at sun.reflect.NativeMethodAccessorImpl.invoke0(Native Method)
	at sun.reflect.NativeMethodAccessorImpl.invoke(NativeMethodAccessorImpl.java:62)
	at sun.reflect.DelegatingMethodAccessorImpl.invoke(DelegatingMethodAccessorImpl.java:43)
(54 more lines...)
Collapse Failed ScheduleClientTestRun testAll History
Unit Test Job 53 secs
java.io.IOException: Service 'Core scheduler' is not available. Please wait until it is up and running.
	at co.cask.cdap.client.util.RESTClient.upload(RESTClient.java:160)
	at co.cask.cdap.client.ApplicationClient.deployApp(ApplicationClient.java:671)
	at co.cask.cdap.client.ApplicationClient.deploy(ApplicationClient.java:497)
	at co.cask.cdap.client.ScheduleClientTestRun.setUp(ScheduleClientTestRun.java:64)
	at sun.reflect.NativeMethodAccessorImpl.invoke0(Native Method)
	at sun.reflect.NativeMethodAccessorImpl.invoke(NativeMethodAccessorImpl.java:62)
	at sun.reflect.DelegatingMethodAccessorImpl.invoke(DelegatingMethodAccessorImpl.java:43)
(54 more lines...)
Collapse Failed ServiceClientTestRun testRouteConfig History
Unit Test Job < 1 sec
co.cask.cdap.common.ServiceUnavailableException: Service 'pingService' is not available. Please wait until it is up and running.
	at co.cask.cdap.client.ServiceClient.checkAvailability(ServiceClient.java:186)
	at co.cask.cdap.client.ServiceClientTestRun.setUp(ServiceClientTestRun.java:98)
	at sun.reflect.NativeMethodAccessorImpl.invoke0(Native Method)
	at sun.reflect.NativeMethodAccessorImpl.invoke(NativeMethodAccessorImpl.java:62)
	at sun.reflect.DelegatingMethodAccessorImpl.invoke(DelegatingMethodAccessorImpl.java:43)
	at java.lang.reflect.Method.invoke(Method.java:498)
	at org.junit.runners.model.FrameworkMethod$1.runReflectiveCall(FrameworkMethod.java:47)
(52 more lines...)
Collapse Failed ServiceClientTestRun testGetServiceSpecification History
Unit Test Job < 1 sec
co.cask.cdap.common.ServiceUnavailableException: Service 'pingService' is not available. Please wait until it is up and running.
	at co.cask.cdap.client.ServiceClient.checkAvailability(ServiceClient.java:186)
	at co.cask.cdap.client.ServiceClientTestRun.setUp(ServiceClientTestRun.java:98)
	at sun.reflect.NativeMethodAccessorImpl.invoke0(Native Method)
	at sun.reflect.NativeMethodAccessorImpl.invoke(NativeMethodAccessorImpl.java:62)
	at sun.reflect.DelegatingMethodAccessorImpl.invoke(DelegatingMethodAccessorImpl.java:43)
	at java.lang.reflect.Method.invoke(Method.java:498)
	at org.junit.runners.model.FrameworkMethod$1.runReflectiveCall(FrameworkMethod.java:47)
(52 more lines...)
Collapse Failed ServiceClientTestRun testGetServiceURL History
Unit Test Job < 1 sec
co.cask.cdap.common.ServiceUnavailableException: Service 'pingService' is not available. Please wait until it is up and running.
	at co.cask.cdap.client.ServiceClient.checkAvailability(ServiceClient.java:186)
	at co.cask.cdap.client.ServiceClientTestRun.setUp(ServiceClientTestRun.java:98)
	at sun.reflect.NativeMethodAccessorImpl.invoke0(Native Method)
	at sun.reflect.NativeMethodAccessorImpl.invoke(NativeMethodAccessorImpl.java:62)
	at sun.reflect.DelegatingMethodAccessorImpl.invoke(DelegatingMethodAccessorImpl.java:43)
	at java.lang.reflect.Method.invoke(Method.java:498)
	at org.junit.runners.model.FrameworkMethod$1.runReflectiveCall(FrameworkMethod.java:47)
(52 more lines...)
Collapse Failed ServiceClientTestRun testActiveStatus History
Unit Test Job < 1 sec
co.cask.cdap.common.ServiceUnavailableException: Service 'pingService' is not available. Please wait until it is up and running.
	at co.cask.cdap.client.ServiceClient.checkAvailability(ServiceClient.java:186)
	at co.cask.cdap.client.ServiceClientTestRun.setUp(ServiceClientTestRun.java:98)
	at sun.reflect.NativeMethodAccessorImpl.invoke0(Native Method)
	at sun.reflect.NativeMethodAccessorImpl.invoke(NativeMethodAccessorImpl.java:62)
	at sun.reflect.DelegatingMethodAccessorImpl.invoke(DelegatingMethodAccessorImpl.java:43)
	at java.lang.reflect.Method.invoke(Method.java:498)
	at org.junit.runners.model.FrameworkMethod$1.runReflectiveCall(FrameworkMethod.java:47)
(52 more lines...)
Collapse Failed ServiceClientTestRun testGetEndpoints History
Unit Test Job < 1 sec
co.cask.cdap.common.ServiceUnavailableException: Service 'pingService' is not available. Please wait until it is up and running.
	at co.cask.cdap.client.ServiceClient.checkAvailability(ServiceClient.java:186)
	at co.cask.cdap.client.ServiceClientTestRun.setUp(ServiceClientTestRun.java:98)
	at sun.reflect.NativeMethodAccessorImpl.invoke0(Native Method)
	at sun.reflect.NativeMethodAccessorImpl.invoke(NativeMethodAccessorImpl.java:62)
	at sun.reflect.DelegatingMethodAccessorImpl.invoke(DelegatingMethodAccessorImpl.java:43)
	at java.lang.reflect.Method.invoke(Method.java:498)
	at org.junit.runners.model.FrameworkMethod$1.runReflectiveCall(FrameworkMethod.java:47)
(52 more lines...)
Collapse Failed StreamClientTestRun testStreamDeleteAfterCreatingView History
Unit Test Job < 1 sec
java.io.IOException: 409: 'namespace:default' could not be deleted. Reason: Service 'Core scheduler' is not available. Please wait until it is up and running.
	at co.cask.cdap.client.util.RESTClient.execute(RESTClient.java:132)
	at co.cask.cdap.client.util.RESTClient.execute(RESTClient.java:69)
	at co.cask.cdap.client.NamespaceClient.execute(NamespaceClient.java:56)
	at co.cask.cdap.common.namespace.AbstractNamespaceClient.delete(AbstractNamespaceClient.java:42)
	at co.cask.cdap.client.StreamClientTestRun.testStreamDeleteAfterCreatingView(StreamClientTestRun.java:268)
	at sun.reflect.NativeMethodAccessorImpl.invoke0(Native Method)
	at sun.reflect.NativeMethodAccessorImpl.invoke(NativeMethodAccessorImpl.java:62)
(56 more lines...)
Collapse Failed UsageHandlerTestRun testFlowUsage History
Unit Test Job 2 secs
java.io.IOException: Service 'Core scheduler' is not available. Please wait until it is up and running.
	at co.cask.cdap.client.util.RESTClient.upload(RESTClient.java:160)
	at co.cask.cdap.client.ApplicationClient.deployApp(ApplicationClient.java:671)
	at co.cask.cdap.client.ApplicationClient.deploy(ApplicationClient.java:497)
	at co.cask.cdap.client.UsageHandlerTestRun.deployApp(UsageHandlerTestRun.java:74)
	at co.cask.cdap.client.UsageHandlerTestRun.testFlowUsage(UsageHandlerTestRun.java:104)
	at sun.reflect.NativeMethodAccessorImpl.invoke0(Native Method)
	at sun.reflect.NativeMethodAccessorImpl.invoke(NativeMethodAccessorImpl.java:62)
(55 more lines...)
Collapse Failed UsageHandlerTestRun testSparkUsage History
Unit Test Job < 1 sec
java.lang.AssertionError: expected:<0> but was:<1>
	at org.junit.Assert.fail(Assert.java:88)
	at org.junit.Assert.failNotEquals(Assert.java:743)
	at org.junit.Assert.assertEquals(Assert.java:118)
	at org.junit.Assert.assertEquals(Assert.java:555)
	at org.junit.Assert.assertEquals(Assert.java:542)
	at co.cask.cdap.client.UsageHandlerTestRun.testSparkUsage(UsageHandlerTestRun.java:210)
	at sun.reflect.NativeMethodAccessorImpl.invoke0(Native Method)
(56 more lines...)
Collapse Failed UsageHandlerTestRun testServiceUsage History
Unit Test Job < 1 sec
java.lang.AssertionError: expected:<0> but was:<1>
	at org.junit.Assert.fail(Assert.java:88)
	at org.junit.Assert.failNotEquals(Assert.java:743)
	at org.junit.Assert.assertEquals(Assert.java:118)
	at org.junit.Assert.assertEquals(Assert.java:555)
	at org.junit.Assert.assertEquals(Assert.java:542)
	at co.cask.cdap.client.UsageHandlerTestRun.testServiceUsage(UsageHandlerTestRun.java:274)
	at sun.reflect.NativeMethodAccessorImpl.invoke0(Native Method)
(56 more lines...)
Collapse Failed UsageHandlerTestRun testMapReduceUsage History
Unit Test Job < 1 sec
java.lang.AssertionError: expected:<0> but was:<1>
	at org.junit.Assert.fail(Assert.java:88)
	at org.junit.Assert.failNotEquals(Assert.java:743)
	at org.junit.Assert.assertEquals(Assert.java:118)
	at org.junit.Assert.assertEquals(Assert.java:555)
	at org.junit.Assert.assertEquals(Assert.java:542)
	at co.cask.cdap.client.UsageHandlerTestRun.testMapReduceUsage(UsageHandlerTestRun.java:170)
	at sun.reflect.NativeMethodAccessorImpl.invoke0(Native Method)
(56 more lines...)
Collapse Failed UsageHandlerTestRun testWorkerUsage History
Unit Test Job < 1 sec
java.lang.AssertionError: expected:<0> but was:<1>
	at org.junit.Assert.fail(Assert.java:88)
	at org.junit.Assert.failNotEquals(Assert.java:743)
	at org.junit.Assert.assertEquals(Assert.java:118)
	at org.junit.Assert.assertEquals(Assert.java:555)
	at org.junit.Assert.assertEquals(Assert.java:542)
	at co.cask.cdap.client.UsageHandlerTestRun.testWorkerUsage(UsageHandlerTestRun.java:130)
	at sun.reflect.NativeMethodAccessorImpl.invoke0(Native Method)
(56 more lines...)
Collapse Failed WorkflowClientTestRun testWorkflowClient History
Unit Test Job 52 secs
java.io.IOException: Service 'Core scheduler' is not available. Please wait until it is up and running.
	at co.cask.cdap.client.util.RESTClient.upload(RESTClient.java:160)
	at co.cask.cdap.client.ApplicationClient.deployApp(ApplicationClient.java:671)
	at co.cask.cdap.client.ApplicationClient.deploy(ApplicationClient.java:497)
	at co.cask.cdap.client.WorkflowClientTestRun.setUp(WorkflowClientTestRun.java:70)
	at sun.reflect.NativeMethodAccessorImpl.invoke0(Native Method)
	at sun.reflect.NativeMethodAccessorImpl.invoke(NativeMethodAccessorImpl.java:62)
	at sun.reflect.DelegatingMethodAccessorImpl.invoke(DelegatingMethodAccessorImpl.java:43)
(54 more lines...)